{"text_format":"1","workbook":"xlsx","n_sheets":7,"sheets":["Rader","Blad1","Poängställning","Blad2","Blad3","Blad5","Blad4"],"not_rendered":{"charts":0,"images":0,"macros":1,"external_links":0,"defined_names":0,"comments":0,"pivot_tables":0},"unopened":[],"bounds":{"document_bytes":16777216,"sheet_cells":100000,"rows_first":2000,"rows_last":500,"rows_between":2000,"halvings":0,"cell_chars":16384,"cell_head_chars":4096},"cells_cut":0,"cells_raw":0,"read":"whole","date_system":"1900"}

{"sheet":"Rader","index":0,"n_rows":56,"n_cols":346,"rows_kept":56,"cut":false,"hidden":false,"merged":[[49,340,49,342],[50,340,50,342],[0,340,0,345],[0,328,0,333],[0,334,0,339],[49,328,49,330],[49,334,49,336],[50,334,50,336],[49,286,49,288],[49,292,49,294],[49,298,49,300],[49,304,49,306],[50,286,50,288],[50,292,50,294],[50,304,50,306],[50,310,50,312],[50,256,50,259],[50,262,50,265],[50,268,50,271],[50,274,50,277],[49,280,49,282],[50,280,50,284],[0,316,0,321],[0,322,0,327],[49,256,49,259],[49,262,49,265],[49,268,49,271],[49,274,49,277],[49,310,49,312],[49,316,49,318],[49,322,49,324],[0,286,0,291],[0,292,0,297],[0,298,0,303],[0,304,0,309],[0,310,0,315],[0,256,0,261],[0,262,0,267],[0,268,0,273],[0,274,0,279],[0,280,0,285],[0,130,0,135],[0,172,0,177],[0,202,0,207],[0,208,0,213],[0,22,0,27],[0,28,0,33],[0,34,0,39],[0,76,0,81],[0,82,0,87],[49,5,49,7],[0,40,0,45],[0,46,0,51],[0,52,0,57],[0,5,0,7],[0,16,0,21],[0,0,0,4],[0,244,0,249],[0,232,0,237],[0,58,0,63],[0,64,0,69],[0,136,0,141],[0,70,0,75],[0,112,0,117],[0,118,0,123],[0,124,0,129],[0,220,0,225],[0,88,0,93],[0,94,0,99],[0,100,0,105],[0,106,0,111],[0,178,0,183],[0,250,0,255],[0,184,0,189],[0,142,0,147],[0,148,0,153],[0,154,0,159],[0,160,0,165],[0,238,0,243],[0,226,0,231],[0,190,0,195],[0,196,0,201],[0,166,0,171],[0,214,0,219]]}
["Fyll i rätt resultat här till höger!",null,null,null,null,"Resultat",null,null,null,null,"Christian",null,null,null,null,null,"Manfreed",null,null,null,null,null,"Jessica",null,null,null,null,null,"Mia E",null,null,null,null,null,"Till minne av Esbjörn",null,null,null,null,null,"Lars L",null,null,null,null,null,"Roger W",null,null,null,null,null,"Roger W 2",null,null,null,null,null,"Tommy T 1",null,null,null,null,null,"Tommy T 2",null,null,null,null,null,"Tommy T 3",null,null,null,null,null,"Reino",null,null,null,null,null,"Lars Haglund",null,null,null,null,null,"Bo Fransson",null,null,null,null,null,"Arne E",null,null,null,null,null,"Jonny E",null,null,null,null,null,"Jonte",null,null,null,null,null,"Mats-ola",null,null,null,null,null,"Mika",null,null,null,null,null,"Romee",null,null,null,null,null,"Anitha",null,null,null,null,null,"Ludde",null,null,null,null,null,"Jonas M",null,null,null,null,null,"Johan G",null,null,null,null,null,"Pernilla",null,null,null,null,null,"Christer 1",null,null,null,null,null,"Christer 2",null,null,null,null,null,"Tina",null,null,null,null,null,"Monika A",null,null,null,null,null,"Edvin A",null,null,null,null,null,"Gustav",null,null,null,null,null,"Torvald",null,null,null,null,null,"Stefan L",null,null,null,null,null,"Dick W1",null,null,null,null,null,"Dick W2",null,null,null,null,null,"Bo Jansson",null,null,null,null,null,"Lennart C1",null,null,null,null,null,"Lennart C2",null,null,null,null,null,"Lennart C3",null,null,null,null,null,"Sonny ",null,null,null,null,null,"Jappe",null,null,null,null,null,"Hans Modh",null,null,null,null,null,"Monica Modh",null,null,null,null,null,"Gille",null,null,null,null,null,"Andreas",null,null,null,null,null,"Ludde 2",null,null,null,null,null,"Alf B",null,null,null,null,null,"Maria I",null,null,null,null,null,"Anne-Marie I",null,null,null,null,null,"Lars, Kjell, Rolf",null,null,null,null,null,"Jan E",null,null,null,null,null,"Rune Tjotta",null,null,null,null,null,"Wiking",null,null,null,null,null,"Janne L",null,null,null,null,null,"Eva W",null,null,null,null,null,"Emma"]
["2018-06-14","Kl 17.00","Ryssland","-","Saudiarabien",5,"-",0,null,{"$f":"IF(F2=\" \",0,IF(F2=H2,\"X\",IF(F2>H2,1,2)))","v":1},2,"-",0,null,{"$f":"IF(K2=M2,\"X\",IF(K2>M2,1,2))","v":1},{"$f":"IF($F2=K2,IF($H2=M2,5,IF($J2=O2,3,0)),IF($J2=O2,3,0))","v":3},1,"-",2,null,{"$f":"IF(Q2=S2,\"X\",IF(Q2>S2,1,2))","v":2},{"$f":"IF($F2=Q2,IF($H2=S2,5,IF($J2=U2,3,0)),IF($J2=U2,3,0))","v":0},2,"-",1,null,{"$f":"IF(W2=Y2,\"X\",IF(W2>Y2,1,2))","v":1},{"$f":"IF($F2=W2,IF($H2=Y2,5,IF($J2=AA2,3,0)),IF($J2=AA2,3,0))","v":3},2,"-",1,null,{"$f":"IF(AC2=AE2,\"X\",IF(AC2>AE2,1,2))","v":1},{"$f":"IF($F2=AC2,IF($H2=AE2,5,IF($J2=AG2,3,0)),IF($J2=AG2,3,0))","v":3},1,"-",0,null,{"$f":"IF(AI2=AK2,\"X\",IF(AI2>AK2,1,2))","v":1},{"$f":"IF($F2=AI2,IF($H2=AK2,5,IF($J2=AM2,3,0)),IF($J2=AM2,3,0))","v":3},2,"-",0,null,{"$f":"IF(AO2=AQ2,\"X\",IF(AO2>AQ2,1,2))","v":1},{"$f":"IF($F2=AO2,IF($H2=AQ2,5,IF($J2=AS2,3,0)),IF($J2=AS2,3,0))","v":3},3,"-",0,null,{"$f":"IF(AU2=AW2,\"X\",IF(AU2>AW2,1,2))","v":1},{"$f":"IF($F2=AU2,IF($H2=AW2,5,IF($J2=AY2,3,0)),IF($J2=AY2,3,0))","v":3},2,"-",1,null,{"$f":"IF(BA2=BC2,\"X\",IF(BA2>BC2,1,2))","v":1},{"$f":"IF($F2=BA2,IF($H2=BC2,5,IF($J2=BE2,3,0)),IF($J2=BE2,3,0))","v":3},2,"-",0,null,{"$f":"IF(BG2=BI2,\"X\",IF(BG2>BI2,1,2))","v":1},{"$f":"IF($F2=BG2,IF($H2=BI2,5,IF($J2=BK2,3,0)),IF($J2=BK2,3,0))","v":3},3,"-",2,null,{"$f":"IF(BM2=BO2,\"X\",IF(BM2>BO2,1,2))","v":1},{"$f":"IF($F2=BM2,IF($H2=BO2,5,IF($J2=BQ2,3,0)),IF($J2=BQ2,3,0))","v":3},1,"-",0,null,{"$f":"IF(BS2=BU2,\"X\",IF(BS2>BU2,1,2))","v":1},{"$f":"IF($F2=BS2,IF($H2=BU2,5,IF($J2=BW2,3,0)),IF($J2=BW2,3,0))","v":3},2,"-",1,null,{"$f":"IF(BY2=CA2,\"X\",IF(BY2>CA2,1,2))","v":1},{"$f":"IF($F2=BY2,IF($H2=CA2,5,IF($J2=CC2,3,0)),IF($J2=CC2,3,0))","v":3},2,"-",1,null,{"$f":"IF(CE2=CG2,\"X\",IF(CE2>CG2,1,2))","v":1},{"$f":"IF($F2=CE2,IF($H2=CG2,5,IF($J2=CI2,3,0)),IF($J2=CI2,3,0))","v":3},1,"-",1,null,{"$f":"IF(CK2=CM2,\"X\",IF(CK2>CM2,1,2))","v":"X"},{"$f":"IF($F2=CK2,IF($H2=CM2,5,IF($J2=CO2,3,0)),IF($J2=CO2,3,0))","v":0},3,"-",0,null,{"$f":"IF(CQ2=CS2,\"X\",IF(CQ2>CS2,1,2))","v":1},{"$f":"IF($F2=CQ2,IF($H2=CS2,5,IF($J2=CU2,3,0)),IF($J2=CU2,3,0))","v":3},3,"-",1,null,{"$f":"IF(CW2=CY2,\"X\",IF(CW2>CY2,1,2))","v":1},{"$f":"IF($F2=CW2,IF($H2=CY2,5,IF($J2=DA2,3,0)),IF($J2=DA2,3,0))","v":3},2,"-",0,null,{"$f":"IF(DC2=DE2,\"X\",IF(DC2>DE2,1,2))","v":1},{"$f":"IF($F2=DC2,IF($H2=DE2,5,IF($J2=DG2,3,0)),IF($J2=DG2,3,0))","v":3},3,"-",0,null,{"$f":"IF(DI2=DK2,\"X\",IF(DI2>DK2,1,2))","v":1},{"$f":"IF($F2=DI2,IF($H2=DK2,5,IF($J2=DM2,3,0)),IF($J2=DM2,3,0))","v":3},2,"-",1,null,{"$f":"IF(DO2=DQ2,\"X\",IF(DO2>DQ2,1,2))","v":1},{"$f":"IF($F2=DO2,IF($H2=DQ2,5,IF($J2=DS2,3,0)),IF($J2=DS2,3,0))","v":3},1,"-",0,null,{"$f":"IF(DU2=DW2,\"X\",IF(DU2>DW2,1,2))","v":1},{"$f":"IF($F2=DU2,IF($H2=DW2,5,IF($J2=DY2,3,0)),IF($J2=DY2,3,0))","v":3},2,"-",1,null,{"$f":"IF(EA2=EC2,\"X\",IF(EA2>EC2,1,2))","v":1},{"$f":"IF($F2=EA2,IF($H2=EC2,5,IF($J2=EE2,3,0)),IF($J2=EE2,3,0))","v":3},2,"-",1,null,{"$f":"IF(EG2=EI2,\"X\",IF(EG2>EI2,1,2))","v":1},{"$f":"IF($F2=EG2,IF($H2=EI2,5,IF($J2=EK2,3,0)),IF($J2=EK2,3,0))","v":3},2,"-",0,null,{"$f":"IF(EM2=EO2,\"X\",IF(EM2>EO2,1,2))","v":1},{"$f":"IF($F2=EM2,IF($H2=EO2,5,IF($J2=EQ2,3,0)),IF($J2=EQ2,3,0))","v":3},2,"-",0,null,{"$f":"IF(ES2=EU2,\"X\",IF(ES2>EU2,1,2))","v":1},{"$f":"IF($F2=ES2,IF($H2=EU2,5,IF($J2=EW2,3,0)),IF($J2=EW2,3,0))","v":3},2,"-",1,null,{"$f":"IF(EY2=FA2,\"X\",IF(EY2>FA2,1,2))","v":1},{"$f":"IF($F2=EY2,IF($H2=FA2,5,IF($J2=FC2,3,0)),IF($J2=FC2,3,0))","v":3},1,"-",1,null,{"$f":"IF(FE2=FG2,\"X\",IF(FE2>FG2,1,2))","v":"X"},{"$f":"IF($F2=FE2,IF($H2=FG2,5,IF($J2=FI2,3,0)),IF($J2=FI2,3,0))","v":0},2,"-",1,null,{"$f":"IF(FK2=FM2,\"X\",IF(FK2>FM2,1,2))","v":1},{"$f":"IF($F2=FK2,IF($H2=FM2,5,IF($J2=FO2,3,0)),IF($J2=FO2,3,0))","v":3},1,"-",0,null,{"$f":"IF(FQ2=FS2,\"X\",IF(FQ2>FS2,1,2))","v":1},{"$f":"IF($F2=FQ2,IF($H2=FS2,5,IF($J2=FU2,3,0)),IF($J2=FU2,3,0))","v":3},1,"-",0,null,{"$f":"IF(FW2=FY2,\"X\",IF(FW2>FY2,1,2))","v":1},{"$f":"IF($F2=FW2,IF($H2=FY2,5,IF($J2=GA2,3,0)),IF($J2=GA2,3,0))","v":3},2,"-",0,null,{"$f":"IF(GC2=GE2,\"X\",IF(GC2>GE2,1,2))","v":1},{"$f":"IF($F2=GC2,IF($H2=GE2,5,IF($J2=GG2,3,0)),IF($J2=GG2,3,0))","v":3},2,"-",1,null,{"$f":"IF(GI2=GK2,\"X\",IF(GI2>GK2,1,2))","v":1},{"$f":"IF($F2=GI2,IF($H2=GK2,5,IF($J2=GM2,3,0)),IF($J2=GM2,3,0))","v":3},2,"-",0,null,{"$f":"IF(GO2=GQ2,\"X\",IF(GO2>GQ2,1,2))","v":1},{"$f":"IF($F2=GO2,IF($H2=GQ2,5,IF($J2=GS2,3,0)),IF($J2=GS2,3,0))","v":3},1,"-",0,null,{"$f":"IF(GU2=GW2,\"X\",IF(GU2>GW2,1,2))","v":1},{"$f":"IF($F2=GU2,IF($H2=GW2,5,IF($J2=GY2,3,0)),IF($J2=GY2,3,0))","v":3},3,"-",1,null,{"$f":"IF(HA2=HC2,\"X\",IF(HA2>HC2,1,2))","v":1},{"$f":"IF($F2=HA2,IF($H2=HC2,5,IF($J2=HE2,3,0)),IF($J2=HE2,3,0))","v":3},3,"-",1,null,{"$f":"IF(HG2=HI2,\"X\",IF(HG2>HI2,1,2))","v":1},{"$f":"IF($F2=HG2,IF($H2=HI2,5,IF($J2=HK2,3,0)),IF($J2=HK2,3,0))","v":3},1,"-",0,null,{"$f":"IF(HM2=HO2,\"X\",IF(HM2>HO2,1,2))","v":1},{"$f":"IF($F2=HM2,IF($H2=HO2,5,IF($J2=HQ2,3,0)),IF($J2=HQ2,3,0))","v":3},3,"-",0,null,{"$f":"IF(HS2=HU2,\"X\",IF(HS2>HU2,1,2))","v":1},{"$f":"IF($F2=HS2,IF($H2=HU2,5,IF($J2=HW2,3,0)),IF($J2=HW2,3,0))","v":3},1,"-",2,null,{"$f":"IF(HY2=IA2,\"X\",IF(HY2>IA2,1,2))","v":2},{"$f":"IF($F2=HY2,IF($H2=IA2,5,IF($J2=IC2,3,0)),IF($J2=IC2,3,0))","v":0},2,"-",2,null,{"$f":"IF(IE2=IG2,\"X\",IF(IE2>IG2,1,2))","v":"X"},{"$f":"IF($F2=IE2,IF($H2=IG2,5,IF($J2=II2,3,0)),IF($J2=II2,3,0))","v":0},1,"-",0,null,{"$f":"IF(IK2=IM2,\"X\",IF(IK2>IM2,1,2))","v":1},{"$f":"IF($F2=IK2,IF($H2=IM2,5,IF($J2=IO2,3,0)),IF($J2=IO2,3,0))","v":3},2,"-",0,null,{"$f":"IF(IQ2=IS2,\"X\",IF(IQ2>IS2,1,2))","v":1},{"$f":"IF($F2=IQ2,IF($H2=IS2,5,IF($J2=IU2,3,0)),IF($J2=IU2,3,0))","v":3},2,"-",0,null,{"$f":"IF(IW2=IY2,\"X\",IF(IW2>IY2,1,2))","v":1},{"$f":"IF($F2=IW2,IF($H2=IY2,5,IF($J2=JA2,3,0)),IF($J2=JA2,3,0))","v":3},2,"-",2,null,{"$f":"IF(JC2=JE2,\"X\",IF(JC2>JE2,1,2))","v":"X"},{"$f":"IF($F2=JC2,IF($H2=JE2,5,IF($J2=JG2,3,0)),IF($J2=JG2,3,0))","v":0},2,"-",1,null,{"$f":"IF(JI2=JK2,\"X\",IF(JI2>JK2,1,2))","v":1},{"$f":"IF($F2=JI2,IF($H2=JK2,5,IF($J2=JM2,3,0)),IF($J2=JM2,3,0))","v":3},2,"-",0,null,{"$f":"IF(JO2=JQ2,\"X\",IF(JO2>JQ2,1,2))","v":1},{"$f":"IF($F2=JO2,IF($H2=JQ2,5,IF($J2=JS2,3,0)),IF($J2=JS2,3,0))","v":3},2,"-",1,null,{"$f":"IF(JU2=JW2,\"X\",IF(JU2>JW2,1,2))","v":1},{"$f":"IF($F2=JU2,IF($H2=JW2,5,IF($J2=JY2,3,0)),IF($J2=JY2,3,0))","v":3},5,"-",2,null,{"$f":"IF(KA2=KC2,\"X\",IF(KA2>KC2,1,2))","v":1},{"$f":"IF($F2=KA2,IF($H2=KC2,5,IF($J2=KE2,3,0)),IF($J2=KE2,3,0))","v":3},2,"-",2,null,{"$f":"IF(KG2=KI2,\"X\",IF(KG2>KI2,1,2))","v":"X"},{"$f":"IF($F2=KG2,IF($H2=KI2,5,IF($J2=KK2,3,0)),IF($J2=KK2,3,0))","v":0},1,"-",0,null,{"$f":"IF(KM2=KO2,\"X\",IF(KM2>KO2,1,2))","v":1},{"$f":"IF($F2=KM2,IF($H2=KO2,5,IF($J2=KQ2,3,0)),IF($J2=KQ2,3,0))","v":3},2,"-",0,null,{"$f":"IF(KS2=KU2,\"X\",IF(KS2>KU2,1,2))","v":1},{"$f":"IF($F2=KS2,IF($H2=KU2,5,IF($J2=KW2,3,0)),IF($J2=KW2,3,0))","v":3},1,"-",0,null,{"$f":"IF(KY2=LA2,\"X\",IF(KY2>LA2,1,2))","v":1},{"$f":"IF($F2=KY2,IF($H2=LA2,5,IF($J2=LC2,3,0)),IF($J2=LC2,3,0))","v":3},2,"-",0,null,{"$f":"IF(LE2=LG2,\"X\",IF(LE2>LG2,1,2))","v":1},{"$f":"IF($F2=LE2,IF($H2=LG2,5,IF($J2=LI2,3,0)),IF($J2=LI2,3,0))","v":3},1,"-",0,null,{"$f":"IF(LK2=LM2,\"X\",IF(LK2>LM2,1,2))","v":1},{"$f":"IF($F2=LK2,IF($H2=LM2,5,IF($J2=LO2,3,0)),IF($J2=LO2,3,0))","v":3},2,"-",1,null,{"$f":"IF(LQ2=LS2,\"X\",IF(LQ2>LS2,1,2))","v":1},{"$f":"IF($F2=LQ2,IF($H2=LS2,5,IF($J2=LU2,3,0)),IF($J2=LU2,3,0))","v":3},1,"-",2,null,{"$f":"IF(LW2=LY2,\"X\",IF(LW2>LY2,1,2))","v":2},{"$f":"IF($F2=LW2,IF($H2=LY2,5,IF($J2=MA2,3,0)),IF($J2=MA2,3,0))","v":0},1,"-",0,null,{"$f":"IF(MC2=ME2,\"X\",IF(MC2>ME2,1,2))","v":1},{"$f":"IF($F2=MC2,IF($H2=ME2,5,IF($J2=MG2,3,0)),IF($J2=MG2,3,0))","v":3}]
["2018-06-15","Kl 14.00","Egypten",{"$f":"D2","v":"-"},"Uruguay",0,"-",1,null,2,0,"-",1,null,2,{"$f":"IF($F3=K3,IF($H3=M3,5,IF($J3=O3,3,0)),IF($J3=O3,3,0))","v":5},2,"-",0,null,1,{"$f":"IF($F3=Q3,IF($H3=S3,5,IF($J3=U3,3,0)),IF($J3=U3,3,0))","v":0},1,"-",1,null,"X",0,1,"-",1,null,"X",0,0,"-",1,null,2,5,0,"-",1,null,2,5,2,"-",2,null,"X",0,0,"-",0,null,"X",0,1,"-",1,null,"X",0,0,"-",4,null,2,3,2,"-",2,null,"X",0,1,"-",2,null,2,3,1,"-",2,null,2,3,0,"-",3,null,2,3,1,"-",4,null,2,3,1,"-",2,null,2,3,1,"-",0,null,1,0,0,"-",1,null,2,5,1,"-",1,null,"X",0,2,"-",2,null,"X",0,1,"-",3,null,2,3,1,"-",2,null,2,3,1,"-",3,null,2,3,1,"-",3,null,2,3,0,"-",3,null,2,3,2,"-",1,null,1,0,1,"-",1,null,"X",0,0,"-",2,null,2,3,0,"-",2,null,2,3,0,"-",2,null,2,3,0,"-",1,null,2,5,0,"-",2,null,2,3,0,"-",2,null,2,3,0,"-",2,null,2,3,2,"-",4,null,2,3,0,"-",0,null,"X",0,0,"-",2,null,2,3,1,"-",1,null,"X",0,1,"-",3,null,2,3,0,"-",0,null,"X",0,1,"-",1,null,"X",0,0,"-",1,null,2,5,0,"-",2,null,2,3,1,"-",1,null,"X",0,1,"-",2,null,2,3,1,"-",2,null,2,3,1,"-",3,null,2,3,1,"-",3,null,2,3,1,"-",2,null,2,3,0,"-",3,null,2,3,0,"-",1,null,2,5,1,"-",3,null,2,3,0,"-",1,null,2,5,1,"-",2,null,2,3,1,"-",0,null,1,0,0,"-",1,null,2,5]
["2018-06-15","Kl 17.00","Marocko","-","Iran",0,"-",1,null,2,1,"-",1,null,"X",0,0,"-",2,null,2,3,0,"-",1,null,2,5,1,"-",3,null,2,3,2,"-",1,null,1,0,0,"-",0,null,"X",0,2,"-",1,null,1,0,1,"-",0,null,1,0,1,"-",2,null,2,3,1,"-",3,null,2,3,1,"-",1,null,"X",0,1,"-",2,null,2,3,1,"-",1,null,"X",0,2,"-",0,null,1,0,2,"-",2,null,"X",0,2,"-",0,null,1,0,1,"-",1,null,"X",0,3,"-",1,null,1,0,1,"-",0,null,1,0,1,"-",2,null,2,3,1,"-",2,null,2,3,0,"-",1,null,2,5,3,"-",2,null,1,0,2,"-",2,null,"X",0,0,"-",1,null,2,5,1,"-",1,null,"X",0,1,"-",2,null,2,3,0,"-",3,null,2,3,1,"-",1,null,"X",0,1,"-",0,null,1,0,1,"-",0,null,1,0,2,"-",1,null,1,0,1,"-",0,null,1,0,1,"-",1,null,"X",0,2,"-",2,null,"X",0,2,"-",0,null,1,0,1,"-",1,null,"X",0,2,"-",1,null,1,0,1,"-",2,null,2,3,2,"-",0,null,1,0,2,"-",1,null,1,0,1,"-",1,null,"X",0,0,"-",3,null,2,3,2,"-",1,null,1,0,3,"-",1,null,1,0,0,"-",1,null,2,5,3,"-",1,null,1,0,3,"-",1,null,1,0,4,"-",1,null,1,0,1,"-",1,null,"X",0,1,"-",1,null,"X",0,0,"-",0,null,"X",0,1,"-",1,null,"X",0,2,"-",1,null,1,0,2,"-",1,null,1,0,2,"-",0,null,1,0]
["2018-06-15","Kl 20.00","Portugal","-","Spanien",3,"-",3,null,"X",1,"-",1,null,"X",3,2,"-",1,null,1,0,2,"-",1,null,1,0,2,"-",2,null,"X",3,0,"-",3,null,2,0,2,"-",2,null,"X",3,1,"-",1,null,"X",3,2,"-",2,null,"X",3,0,"-",0,null,"X",3,3,"-",3,null,"X",5,1,"-",2,null,2,0,3,"-",1,null,1,0,1,"-",3,null,2,0,1,"-",2,null,2,0,2,"-",1,null,1,0,1,"-",1,null,"X",3,1,"-",1,null,"X",3,2,"-",2,null,"X",3,1,"-",2,null,2,0,2,"-",2,null,"X",3,1,"-",1,null,"X",3,1,"-",3,null,2,0,2,"-",1,null,1,0,1,"-",2,null,2,0,2,"-",2,null,"X",3,1,"-",2,null,2,0,2,"-",2,null,"X",3,0,"-",3,null,2,0,1,"-",1,null,"X",3,1,"-",0,null,1,0,3,"-",1,null,1,0,1,"-",1,null,"X",3,1,"-",1,null,"X",3,1,"-",3,null,2,0,3,"-",1,null,1,0,1,"-",1,null,"X",3,1,"-",1,null,"X",3,0,"-",1,null,2,0,1,"-",0,null,1,0,1,"-",1,null,"X",3,1,"-",2,null,2,0,1,"-",1,null,"X",3,0,"-",1,null,2,0,0,"-",1,null,2,0,1,"-",1,null,"X",3,1,"-",3,null,2,0,4,"-",1,null,1,0,4,"-",3,null,1,0,4,"-",3,null,1,0,1,"-",2,null,2,0,0,"-",2,null,2,0,0,"-",0,null,"X",3,1,"-",2,null,2,0,2,"-",0,null,1,0,1,"-",1,null,"X",3,2,"-",1,null,1,0]
["2018-06-16","Kl 12.00","Frankrike","-","Australien"," ","-"," ",null,0,1,"-",0,null,1,0,1,"-",0,null,1,0,2,"-",1,null,1,0,4,"-",1,null,1,0,1,"-",0,null,1,0,3,"-",1,null,1,0,3,"-",1,null,1,0,2,"-",0,null,1,0,3,"-",0,null,1,0,2,"-",1,null,1,0,2,"-",0,null,1,0,2,"-",1,null,1,0,2,"-",0,null,1,0,2,"-",0,null,1,0,4,"-",2,null,1,0,2,"-",0,null,1,0,2,"-",1,null,1,0,2,"-",1,null,1,0,3,"-",0,null,1,0,3,"-",1,null,1,0,2,"-",0,null,1,0,2,"-",1,null,1,0,4,"-",1,null,1,0,4,"-",0,null,1,0,3,"-",1,null,1,0,3,"-",0,null,1,0,4,"-",0,null,1,0,2,"-",0,null,1,0,2,"-",0,null,1,0,2,"-",0,null,1,0,3,"-",0,null,1,0,2,"-",0,null,1,0,2,"-",1,null,1,0,3,"-",0,null,1,0,2,"-",3,null,2,0,3,"-",0,null,1,0,2,"-",1,null,1,0,3,"-",0,null,1,0,1,"-",1,null,"X",0,2,"-",0,null,1,0,1,"-",0,null,1,0,2,"-",0,null,1,0,2,"-",0,null,1,0,2,"-",0,null,1,0,4,"-",0,null,1,0,2,"-",1,null,1,0,4,"-",1,null,1,0,4,"-",3,null,1,0,3,"-",2,null,1,0,3,"-",1,null,1,0,2,"-",1,null,1,0,3,"-",0,null,1,0,2,"-",0,null,1,0,3,"-",0,null,1,0,2,"-",0,null,1,0,1,"-",0,null,1,0]
["2018-06-16","Kl 15.00","Argentina","-","Island"," ","-"," ",null,0,2,"-",1,null,1,0,0,"-",1,null,2,0,2,"-",0,null,1,0,2,"-",1,null,1,0,1,"-",0,null,1,0,3,"-",0,null,1,0,3,"-",0,null,1,0,2,"-",1,null,1,0,2,"-",1,null,1,0,3,"-",2,null,1,0,2,"-",2,null,"X",0,3,"-",1,null,1,0,3,"-",1,null,1,0,1,"-",0,null,1,0,5,"-",0,null,1,0,3,"-",0,null,1,0,2,"-",0,null,1,0,0,"-",0,null,"X",0,2,"-",0,null,1,0,2,"-",1,null,1,0,2,"-",0,null,1,0,1,"-",0,null,1,0,3,"-",0,null,1,0,4,"-",1,null,1,0,2,"-",0,null,1,0,1,"-",1,null,"X",0,2,"-",1,null,1,0,1,"-",1,null,"X",0,3,"-",1,null,1,0,2,"-",0,null,1,0,3,"-",1,null,1,0,3,"-",0,null,1,0,2,"-",1,null,1,0,2,"-",2,null,"X",0,1,"-",3,null,2,0,2,"-",0,null,1,0,3,"-",0,null,1,0,1,"-",0,null,1,0,1,"-",1,null,"X",0,1,"-",0,null,1,0,2,"-",0,null,1,0,3,"-",0,null,1,0,4,"-",1,null,1,0,2,"-",1,null,1,0,1,"-",2,null,2,0,1,"-",0,null,1,0,6,"-",2,null,1,0,4,"-",3,null,1,0,2,"-",2,null,"X",0,2,"-",0,null,1,0,1,"-",1,null,"X",0,2,"-",1,null,1,0,2,"-",0,null,1,0,2,"-",0,null,1,0,3,"-",0,null,1,0,0,"-",0,null,"X",0]
["2018-06-16","Kl 18.00","Peru","-","Danmark"," ","-"," ",null,0,0,"-",0,null,"X",0,1,"-",2,null,2,0,1,"-",0,null,1,0,1,"-",3,null,2,0,0,"-",1,null,2,0,1,"-",2,null,2,0,0,"-",3,null,2,0,1,"-",2,null,2,0,2,"-",0,null,1,0,0,"-",3,null,2,0,1,"-",0,null,1,0,1,"-",3,null,2,0,1,"-",3,null,2,0,0,"-",1,null,2,0,0,"-",3,null,2,0,0,"-",0,null,"X",0,1,"-",2,null,2,0,1,"-",3,null,2,0,1,"-",1,null,"X",0,0,"-",1,null,2,0,1,"-",3,null,2,0,2,"-",1,null,1,0,1,"-",3,null,2,0,0,"-",2,null,2,0,1,"-",1,null,"X",0,1,"-",2,null,2,0,1,"-",1,null,"X",0,0,"-",1,null,2,0,0,"-",0,null,"X",0,1,"-",2,null,2,0,1,"-",1,null,"X",0,1,"-",2,null,2,0,2,"-",1,null,1,0,1,"-",2,null,2,0,1,"-",4,null,2,0,1,"-",1,null,"X",0,0,"-",2,null,2,0,1,"-",1,null,"X",0,2,"-",2,null,"X",0,2,"-",1,null,1,0,1,"-",1,null,"X",0,1,"-",1,null,"X",0,0,"-",1,null,2,0,1,"-",2,null,2,0,0,"-",1,null,2,0,2,"-",1,null,1,0,2,"-",3,null,2,0,2,"-",2,null,"X",0,4,"-",3,null,1,0,1,"-",2,null,2,0,0,"-",1,null,2,0,1,"-",1,null,"X",0,1,"-",1,null,"X",0,0,"-",2,null,2,0,1,"-",2,null,2,0,1,"-",2,null,2,0]
["2018-06-16","Kl 21.00","Kroatien","-","Nigeria"," ","-"," ",null,0,2,"-",1,null,1,0,2,"-",0,null,1,0,1,"-",2,null,2,0,1,"-",2,null,2,0,0,"-",2,null,2,0,1,"-",0,null,1,0,1,"-",1,null,"X",0,3,"-",3,null,"X",0,1,"-",0,null,1,0,0,"-",2,null,2,0,2,"-",1,null,1,0,2,"-",1,null,1,0,3,"-",1,null,1,0,1,"-",1,null,"X",0,1,"-",1,null,"X",0,2,"-",3,null,2,0,1,"-",0,null,1,0,1,"-",0,null,1,0,2,"-",0,null,1,0,2,"-",0,null,1,0,2,"-",2,null,"X",0,2,"-",1,null,1,0,2,"-",2,null,"X",0,2,"-",1,null,1,0,2,"-",1,null,1,0,2,"-",2,null,"X",0,2,"-",1,null,1,0,1,"-",2,null,2,0,1,"-",0,null,1,0,1,"-",1,null,"X",0,2,"-",2,null,"X",0,2,"-",0,null,1,0,2,"-",1,null,1,0,2,"-",3,null,2,0,2,"-",3,null,2,0,1,"-",0,null,1,0,1,"-",1,null,"X",0,2,"-",1,null,1,0,1,"-",2,null,2,0,1,"-",3,null,2,0,2,"-",1,null,1,0,1,"-",1,null,"X",0,2,"-",0,null,1,0,1,"-",2,null,2,0,2,"-",1,null,1,0,2,"-",1,null,1,0,1,"-",4,null,2,0,2,"-",0,null,1,0,2,"-",3,null,2,0,0,"-",3,null,2,0,2,"-",2,null,"X",0,1,"-",0,null,1,0,2,"-",0,null,1,0,1,"-",3,null,2,0,2,"-",1,null,1,0,0,"-",1,null,2,0]
["2018-06-17","Kl 14.00","Costa Rica","-","Serbien"," ","-"," ",null,0,0,"-",1,null,2,0,0,"-",2,null,2,0,3,"-",1,null,1,0,1,"-",1,null,"X",0,2,"-",0,null,1,0,2,"-",2,null,"X",0,1,"-",1,null,"X",0,0,"-",0,null,"X",0,1,"-",1,null,"X",0,1,"-",1,null,"X",0,2,"-",0,null,1,0,1,"-",3,null,2,0,1,"-",2,null,2,0,0,"-",0,null,"X",0,2,"-",0,null,1,0,1,"-",1,null,"X",0,1,"-",1,null,"X",0,0,"-",1,null,2,0,1,"-",0,null,1,0,0,"-",2,null,2,0,2,"-",1,null,1,0,0,"-",1,null,2,0,2,"-",0,null,1,0,1,"-",1,null,"X",0,1,"-",0,null,1,0,1,"-",3,null,2,0,1,"-",2,null,2,0,0,"-",2,null,2,0,2,"-",1,null,1,0,0,"-",2,null,2,0,0,"-",1,null,2,0,2,"-",0,null,1,0,1,"-",1,null,"X",0,1,"-",3,null,2,0,3,"-",1,null,1,0,1,"-",1,null,"X",0,2,"-",2,null,"X",0,1,"-",1,null,"X",0,1,"-",0,null,1,0,2,"-",2,null,"X",0,0,"-",3,null,2,0,0,"-",2,null,2,0,1,"-",1,null,"X",0,1,"-",1,null,"X",0,0,"-",2,null,2,0,0,"-",1,null,2,0,4,"-",1,null,1,0,2,"-",0,null,1,0,3,"-",1,null,1,0,0,"-",1,null,2,0,1,"-",1,null,"X",0,1,"-",1,null,"X",0,1,"-",1,null,"X",0,2,"-",0,null,1,0,1,"-",3,null,2,0,1,"-",2,null,2,0]
["2018-06-17","Kl 17.00","Tyskland","-","Mexiko"," ","-"," ",null,0,2,"-",0,null,1,0,2,"-",1,null,1,0,2,"-",1,null,1,0,3,"-",0,null,1,0,2,"-",0,null,1,0,3,"-",0,null,1,0,3,"-",0,null,1,0,2,"-",0,null,1,0,2,"-",1,null,1,0,3,"-",0,null,1,0,1,"-",1,null,"X",0,4,"-",1,null,1,0,4,"-",1,null,1,0,1,"-",0,null,1,0,3,"-",3,null,"X",0,2,"-",1,null,1,0,1,"-",0,null,1,0,2,"-",0,null,1,0,2,"-",0,null,1,0,3,"-",0,null,1,0,2,"-",2,null,"X",0,3,"-",0,null,1,0,2,"-",0,null,1,0,3,"-",1,null,1,0,3,"-",1,null,1,0,2,"-",0,null,1,0,3,"-",1,null,1,0,0,"-",0,null,"X",0,2,"-",0,null,1,0,3,"-",1,null,1,0,3,"-",1,null,1,0,2,"-",0,null,1,0,2,"-",0,null,1,0,3,"-",1,null,1,0,5,"-",2,null,1,0,2,"-",0,null,1,0,2,"-",0,null,1,0,1,"-",0,null,1,0,1,"-",1,null,"X",0,1,"-",1,null,"X",0,2,"-",0,null,1,0,2,"-",1,null,1,0,3,"-",0,null,1,0,3,"-",1,null,1,0,3,"-",1,null,1,0,3,"-",0,null,1,0,3,"-",5,null,2,0,6,"-",5,null,1,0,4,"-",0,null,1,0,1,"-",1,null,"X",0,2,"-",1,null,1,0,2,"-",0,null,1,0,2,"-",0,null,1,0,1,"-",1,null,"X",0,3,"-",1,null,1,0,4,"-",2,null,1,0]
["2018-06-17","Kl 20.00","Brasilien","-","Schweiz"," ","-"," ",null,0,2,"-",0,null,1,0,1,"-",2,null,2,0,2,"-",0,null,1,0,4,"-",1,null,1,0,2,"-",0,null,1,0,2,"-",2,null,"X",0,4,"-",1,null,1,0,3,"-",1,null,1,0,4,"-",1,null,1,0,3,"-",3,null,"X",0,2,"-",0,null,1,0,3,"-",1,null,1,0,3,"-",1,null,1,0,2,"-",0,null,1,0,4,"-",0,null,1,0,2,"-",0,null,1,0,2,"-",0,null,1,0,1,"-",1,null,"X",0,3,"-",1,null,1,0,2,"-",0,null,1,0,3,"-",0,null,1,0,4,"-",2,null,1,0,6,"-",1,null,1,0,3,"-",1,null,1,0,4,"-",0,null,1,0,1,"-",1,null,"X",0,3,"-",0,null,1,0,3,"-",1,null,1,0,1,"-",1,null,"X",0,3,"-",0,null,1,0,2,"-",1,null,1,0,2,"-",1,null,1,0,2,"-",1,null,1,0,3,"-",0,null,1,0,4,"-",2,null,1,0,1,"-",1,null,"X",0,2,"-",0,null,1,0,1,"-",1,null,"X",0,3,"-",1,null,1,0,1,"-",0,null,1,0,2,"-",1,null,1,0,3,"-",1,null,1,0,3,"-",0,null,1,0,3,"-",1,null,1,0,2,"-",2,null,"X",0,4,"-",2,null,1,0,3,"-",3,null,"X",0,4,"-",3,null,1,0,2,"-",2,null,"X",0,2,"-",1,null,1,0,1,"-",0,null,1,0,3,"-",1,null,1,0,2,"-",0,null,1,0,2,"-",0,null,1,0,2,"-",0,null,1,0,3,"-",1,null,1,0]
["2018-06-18","Kl 14.00","Sverige","-","Sydkorea"," ","-",null,null,0,2,"-",1,null,1,0,2,"-",0,null,1,0,1,"-",0,null,1,0,2,"-",1,null,1,0,1,"-",0,null,1,0,2,"-",0,null,1,0,2,"-",0,null,1,0,1,"-",0,null,1,0,2,"-",0,null,1,0,2,"-",1,null,1,0,1,"-",1,null,"X",0,2,"-",1,null,1,0,2,"-",1,null,1,0,1,"-",0,null,1,0,2,"-",1,null,1,0,2,"-",0,null,1,0,1,"-",0,null,1,0,2,"-",0,null,1,0,2,"-",1,null,1,0,2,"-",1,null,1,0,3,"-",1,null,1,0,2,"-",1,null,1,0,4,"-",2,null,1,0,2,"-",1,null,1,0,2,"-",0,null,1,0,2,"-",0,null,1,0,1,"-",0,null,1,0,1,"-",1,null,"X",0,1,"-",0,null,1,0,2,"-",0,null,1,0,2,"-",0,null,1,0,2,"-",1,null,1,0,1,"-",1,null,"X",0,2,"-",1,null,1,0,3,"-",3,null,"X",0,1,"-",0,null,1,0,0,"-",1,null,2,0,1,"-",1,null,"X",0,2,"-",1,null,1,0,2,"-",0,null,1,0,2,"-",0,null,1,0,1,"-",1,null,"X",0,2,"-",1,null,1,0,2,"-",1,null,1,0,2,"-",1,null,1,0,2,"-",1,null,1,0,2,"-",2,null,"X",0,0,"-",1,null,2,0,3,"-",0,null,1,0,3,"-",1,null,1,0,2,"-",1,null,1,0,1,"-",1,null,"X",0,1,"-",1,null,"X",0,1,"-",1,null,"X",0,2,"-",0,null,1,0,1,"-",0,null,1,0]
["2018-06-18","Kl 17.00","Belgien","-","Panama"," ","-",null,null,0,2,"-",0,null,1,0,0,"-",1,null,2,0,1,"-",0,null,1,0,3,"-",1,null,1,0,0,"-",2,null,2,0,3,"-",0,null,1,0,4,"-",0,null,1,0,5,"-",0,null,1,0,2,"-",1,null,1,0,3,"-",0,null,1,0,4,"-",0,null,1,0,3,"-",1,null,1,0,2,"-",2,null,"X",0,1,"-",1,null,"X",0,3,"-",3,null,"X",0,1,"-",0,null,1,0,0,"-",1,null,2,0,2,"-",1,null,1,0,2,"-",0,null,1,0,1,"-",0,null,1,0,3,"-",2,null,1,0,1,"-",1,null,"X",0,2,"-",2,null,"X",0,4,"-",0,null,1,0,3,"-",1,null,1,0,5,"-",0,null,1,0,4,"-",0,null,1,0,0,"-",0,null,"X",0,2,"-",0,null,1,0,4,"-",0,null,1,0,3,"-",0,null,1,0,2,"-",0,null,1,0,2,"-",0,null,1,0,3,"-",1,null,1,0,2,"-",1,null,1,0,2,"-",0,null,1,0,3,"-",1,null,1,0,1,"-",1,null,"X",0,2,"-",0,null,1,0,3,"-",1,null,1,0,1,"-",0,null,1,0,2,"-",0,null,1,0,2,"-",0,null,1,0,4,"-",0,null,1,0,2,"-",3,null,2,0,1,"-",1,null,"X",0,3,"-",1,null,1,0,6,"-",2,null,1,0,3,"-",0,null,1,0,2,"-",0,null,1,0,2,"-",0,null,1,0,2,"-",0,null,1,0,2,"-",0,null,1,0,1,"-",0,null,1,0,1,"-",0,null,1,0,0,"-",0,null,"X",0]
["2018-06-18","Kl 20.00","Tunisien","-","England"," ","-",null,null,0,1,"-",1,null,"X",0,1,"-",2,null,2,0,0,"-",2,null,2,0,0,"-",2,null,2,0,0,"-",2,null,2,0,1,"-",3,null,2,0,1,"-",1,null,"X",0,0,"-",0,null,"X",0,1,"-",2,null,2,0,1,"-",3,null,2,0,0,"-",0,null,"X",0,1,"-",3,null,2,0,2,"-",3,null,2,0,0,"-",3,null,2,0,1,"-",4,null,2,0,1,"-",2,null,2,0,1,"-",2,null,2,0,0,"-",1,null,2,0,0,"-",2,null,2,0,1,"-",2,null,2,0,1,"-",3,null,2,0,0,"-",2,null,2,0,1,"-",3,null,2,0,1,"-",2,null,2,0,1,"-",2,null,2,0,1,"-",2,null,2,0,0,"-",2,null,2,0,1,"-",0,null,1,0,0,"-",0,null,"X",0,0,"-",2,null,2,0,0,"-",2,null,2,0,0,"-",2,null,2,0,0,"-",1,null,2,0,1,"-",3,null,2,0,2,"-",4,null,2,0,0,"-",2,null,2,0,1,"-",3,null,2,0,2,"-",2,null,"X",0,0,"-",1,null,2,0,0,"-",2,null,2,0,0,"-",2,null,2,0,0,"-",1,null,2,0,0,"-",2,null,2,0,1,"-",2,null,2,0,0,"-",3,null,2,0,0,"-",2,null,2,0,0,"-",3,null,2,0,1,"-",2,null,2,0,1,"-",3,null,2,0,1,"-",2,null,2,0,1,"-",3,null,2,0,1,"-",2,null,2,0,1,"-",2,null,2,0,1,"-",4,null,2,0,0,"-",2,null,2,0,1,"-",3,null,2,0]
["2018-06-19","Kl 14.00","Colombia","-","Japan"," ","-",null,null,0,0,"-",1,null,2,0,2,"-",0,null,1,0,2,"-",1,null,1,0,1,"-",2,null,2,0,0,"-",1,null,2,0,2,"-",1,null,1,0,3,"-",1,null,1,0,2,"-",1,null,1,0,2,"-",0,null,1,0,0,"-",0,null,"X",0,3,"-",1,null,1,0,1,"-",2,null,2,0,1,"-",0,null,1,0,0,"-",1,null,2,0,0,"-",0,null,"X",0,3,"-",0,null,1,0,1,"-",0,null,1,0,0,"-",1,null,2,0,1,"-",1,null,"X",0,2,"-",1,null,1,0,2,"-",1,null,1,0,3,"-",2,null,1,0,4,"-",2,null,1,0,0,"-",1,null,2,0,2,"-",0,null,1,0,1,"-",1,null,"X",0,2,"-",1,null,1,0,0,"-",2,null,2,0,3,"-",0,null,1,0,2,"-",0,null,1,0,2,"-",0,null,1,0,2,"-",0,null,1,0,2,"-",0,null,1,0,3,"-",1,null,1,0,3,"-",2,null,1,0,2,"-",1,null,1,0,2,"-",1,null,1,0,2,"-",0,null,1,0,1,"-",0,null,1,0,3,"-",1,null,1,0,1,"-",0,null,1,0,2,"-",1,null,1,0,1,"-",1,null,"X",0,2,"-",1,null,1,0,2,"-",0,null,1,0,3,"-",2,null,1,0,6,"-",1,null,1,0,3,"-",1,null,1,0,2,"-",3,null,2,0,1,"-",1,null,"X",0,0,"-",0,null,"X",0,0,"-",0,null,"X",0,2,"-",1,null,1,0,2,"-",0,null,1,0,1,"-",0,null,1,0,2,"-",2,null,"X",0]
["2018-06-19","Kl 17.00","Polen","-","Senegal"," ","-",null,null,0,1,"-",1,null,"X",0,0,"-",2,null,2,0,0,"-",1,null,2,0,1,"-",2,null,2,0,1,"-",1,null,"X",0,2,"-",0,null,1,0,0,"-",1,null,2,0,0,"-",2,null,2,0,1,"-",1,null,"X",0,2,"-",2,null,"X",0,1,"-",0,null,1,0,2,"-",0,null,1,0,1,"-",1,null,"X",0,2,"-",1,null,1,0,3,"-",0,null,1,0,1,"-",2,null,2,0,2,"-",1,null,1,0,1,"-",0,null,1,0,1,"-",0,null,1,0,1,"-",1,null,"X",0,1,"-",1,null,"X",0,2,"-",1,null,1,0,1,"-",3,null,2,0,1,"-",2,null,2,0,1,"-",1,null,"X",0,2,"-",1,null,1,0,1,"-",1,null,"X",0,2,"-",2,null,"X",0,2,"-",1,null,1,0,1,"-",0,null,1,0,2,"-",1,null,1,0,1,"-",1,null,"X",0,2,"-",0,null,1,0,2,"-",0,null,1,0,4,"-",2,null,1,0,2,"-",0,null,1,0,1,"-",3,null,2,0,0,"-",0,null,"X",0,1,"-",1,null,"X",0,1,"-",0,null,1,0,1,"-",0,null,1,0,1,"-",1,null,"X",0,2,"-",2,null,"X",0,0,"-",0,null,"X",0,2,"-",2,null,"X",0,2,"-",1,null,1,0,1,"-",3,null,2,0,1,"-",3,null,2,0,2,"-",1,null,1,0,1,"-",2,null,2,0,0,"-",0,null,"X",0,2,"-",1,null,1,0,1,"-",0,null,1,0,2,"-",1,null,1,0,1,"-",1,null,"X",0,1,"-",2,null,2,0]
["2018-06-19","Kl 20.00","Ryssland","-","Egypten"," ","-",null,null,0,0,"-",1,null,2,0,2,"-",0,null,1,0,2,"-",0,null,1,0,3,"-",1,null,1,0,2,"-",0,null,1,0,3,"-",0,null,1,0,1,"-",2,null,2,0,0,"-",3,null,2,0,1,"-",0,null,1,0,3,"-",2,null,1,0,1,"-",1,null,"X",0,3,"-",1,null,1,0,2,"-",1,null,1,0,3,"-",1,null,1,0,4,"-",1,null,1,0,1,"-",1,null,"X",0,1,"-",0,null,1,0,2,"-",0,null,1,0,2,"-",0,null,1,0,3,"-",1,null,1,0,3,"-",2,null,1,0,2,"-",1,null,1,0,2,"-",3,null,2,0,2,"-",1,null,1,0,0,"-",0,null,"X",0,1,"-",2,null,2,0,1,"-",1,null,"X",0,3,"-",0,null,1,0,1,"-",1,null,"X",0,2,"-",0,null,1,0,2,"-",1,null,1,0,2,"-",0,null,1,0,1,"-",0,null,1,0,4,"-",1,null,1,0,4,"-",1,null,1,0,1,"-",1,null,"X",0,1,"-",0,null,1,0,2,"-",1,null,1,0,1,"-",1,null,"X",0,0,"-",1,null,2,0,2,"-",0,null,1,0,0,"-",0,null,"X",0,2,"-",1,null,1,0,2,"-",0,null,1,0,1,"-",1,null,"X",0,2,"-",1,null,1,0,4,"-",4,null,"X",0,3,"-",1,null,1,0,3,"-",2,null,1,0,1,"-",1,null,"X",0,1,"-",0,null,1,0,2,"-",0,null,1,0,1,"-",1,null,"X",0,3,"-",0,null,1,0,1,"-",2,null,2,0,1,"-",1,null,"X",0]
["2018-06-20","Kl 14.00","Portugal","-","Marocko"," ","-",null,null,0,3,"-",0,null,1,0,0,"-",0,null,"X",0,2,"-",1,null,1,0,2,"-",1,null,1,0,1,"-",0,null,1,0,1,"-",0,null,1,0,3,"-",0,null,1,0,2,"-",1,null,1,0,3,"-",0,null,1,0,3,"-",1,null,1,0,2,"-",0,null,1,0,3,"-",1,null,1,0,3,"-",1,null,1,0,1,"-",0,null,1,0,4,"-",2,null,1,0,2,"-",0,null,1,0,3,"-",1,null,1,0,2,"-",0,null,1,0,3,"-",1,null,1,0,2,"-",0,null,1,0,0,"-",1,null,2,0,2,"-",2,null,"X",0,1,"-",1,null,"X",0,3,"-",0,null,1,0,3,"-",0,null,1,0,2,"-",0,null,1,0,3,"-",1,null,1,0,1,"-",0,null,1,0,2,"-",0,null,1,0,2,"-",1,null,1,0,3,"-",0,null,1,0,2,"-",0,null,1,0,2,"-",1,null,1,0,3,"-",1,null,1,0,3,"-",1,null,1,0,2,"-",0,null,1,0,2,"-",0,null,1,0,1,"-",0,null,1,0,1,"-",1,null,"X",0,2,"-",0,null,1,0,2,"-",1,null,1,0,2,"-",0,null,1,0,3,"-",0,null,1,0,2,"-",0,null,1,0,3,"-",0,null,1,0,2,"-",2,null,"X",0,3,"-",5,null,2,0,3,"-",2,null,1,0,3,"-",2,null,1,0,2,"-",0,null,1,0,2,"-",0,null,1,0,2,"-",0,null,1,0,2,"-",0,null,1,0,3,"-",0,null,1,0,2,"-",0,null,1,0,4,"-",1,null,1,0]
["2018-06-20","Kl 17.00","Uruguay","-","Saudiarabien"," ","-",null,null,0,2,"-",0,null,1,0,0,"-",1,null,2,0,1,"-",0,null,1,0,0,"-",0,null,"X",0,2,"-",1,null,1,0,1,"-",1,null,"X",0,4,"-",0,null,1,0,5,"-",0,null,1,0,4,"-",1,null,1,0,1,"-",1,null,"X",0,2,"-",1,null,1,0,2,"-",1,null,1,0,2,"-",1,null,1,0,0,"-",0,null,"X",0,2,"-",2,null,"X",0,3,"-",0,null,1,0,1,"-",0,null,1,{"$f":"IF($F20=DC20,IF($H20=DE20,5,IF($J20=DG20,3,0)),IF($J20=DG20,3,0))","v":0},1,"-",0,null,1,0,1,"-",0,null,1,0,2,"-",1,null,1,0,1,"-",1,null,"X",0,1,"-",3,null,2,0,3,"-",2,null,1,0,3,"-",0,null,1,0,2,"-",1,null,1,0,2,"-",0,null,1,0,2,"-",1,null,1,0,2,"-",0,null,1,0,2,"-",0,null,1,0,2,"-",0,null,1,0,1,null,1,null,"X",0,2,"-",0,null,1,0,2,"-",0,null,1,0,2,"-",0,null,1,0,2,"-",3,null,2,0,2,"-",0,null,1,0,0,"-",0,null,"X",0,1,"-",0,null,1,0,0,"-",2,null,2,0,1,"-",0,null,1,0,1,"-",0,null,1,0,1,"-",0,null,1,0,0,"-",0,null,"X",0,1,"-",1,null,"X",0,2,"-",1,null,1,0,1,"-",3,null,2,0,5,"-",3,null,1,0,5,"-",0,null,1,0,2,"-",2,null,"X",0,1,"-",1,null,"X",0,2,"-",0,null,1,0,3,"-",0,null,1,0,2,"-",0,null,1,0,1,"-",1,null,"X",0,0,"-",0,null,"X",0,2,"-",2,null,"X",0]
["2018-06-20","Kl 20.00","Iran","-","Spanien"," ","-",null,null,0,1,"-",2,null,2,0,1,"-",0,null,1,0,0,"-",2,null,2,0,1,"-",3,null,2,0,0,"-",1,null,2,0,1,"-",2,null,2,0,1,"-",4,null,2,0,0,"-",3,null,2,0,1,"-",3,null,2,0,1,"-",3,null,2,0,0,"-",2,null,2,0,0,"-",3,null,2,0,0,"-",3,null,2,0,0,"-",2,null,2,0,0,"-",4,null,2,0,0,"-",3,null,2,0,0,"-",2,null,2,0,0,"-",2,null,2,0,0,"-",2,null,2,0,0,"-",3,null,2,0,0,"-",3,null,2,0,0,"-",2,null,2,0,1,"-",4,null,2,0,0,"-",3,null,2,0,0,"-",2,null,2,0,0,"-",1,null,2,0,0,"-",0,null,"X",0,1,"-",3,null,2,0,0,"-",2,null,2,0,0,"-",3,null,2,0,0,"-",3,null,2,0,0,"-",2,null,2,0,0,"-",2,null,2,0,1,"-",3,null,2,0,2,"-",2,null,"X",0,0,"-",3,null,2,0,1,"-",1,null,"X",0,0,"-",0,null,"X",0,0,"-",2,null,2,0,0,"-",3,null,2,0,0,"-",2,null,2,0,0,"-",2,null,2,0,0,"-",2,null,2,0,0,"-",3,null,2,0,0,"-",3,null,2,0,0,"-",2,null,2,0,1,"-",2,null,2,0,1,"-",5,null,2,0,1,"-",3,null,2,0,1,"-",2,null,2,0,1,"-",2,null,2,0,0,"-",3,null,2,0,0,"-",2,null,2,0,0,"-",3,null,2,0,0,"-",3,null,2,0,0,"-",2,null,2,0]
["2018-06-21","Kl 14.00","Danmark","-","Australien"," ","-",null,null,0,1,"-",1,null,"X",0,0,"-",2,null,2,0,1,"-",0,null,1,0,2,"-",2,null,"X",0,1,"-",0,null,1,0,2,"-",1,null,1,0,1,"-",1,null,"X",0,2,"-",2,null,"X",0,2,"-",0,null,1,0,2,"-",1,null,1,0,1,"-",1,null,"X",0,2,"-",2,null,"X",0,1,"-",0,null,1,0,1,"-",0,null,1,0,3,"-",1,null,1,0,1,"-",1,null,"X",0,1,"-",1,null,"X",0,2,"-",1,null,1,0,1,"-",1,null,"X",0,1,"-",1,null,"X",0,3,"-",2,null,1,0,2,"-",1,null,1,0,2,"-",1,null,1,0,2,"-",1,null,1,0,2,"-",2,null,"X",0,2,"-",2,null,"X",0,1,"-",0,null,1,0,2,"-",0,null,1,0,1,"-",1,null,"X",0,1,"-",0,null,1,0,2,"-",1,null,1,0,1,"-",0,null,1,0,2,"-",1,null,1,0,2,"-",2,null,"X",0,4,"-",3,null,1,0,0,"-",0,null,"X",0,1,"-",1,null,"X",0,0,"-",1,null,2,0,2,"-",1,null,1,0,2,"-",1,null,1,0,1,"-",0,null,1,0,2,"-",2,null,"X",0,1,"-",1,null,"X",0,2,"-",1,null,1,0,1,"-",0,null,1,0,2,"-",1,null,1,0,4,"-",0,null,1,0,4,"-",4,null,"X",0,3,"-",1,null,1,0,2,"-",2,null,"X",0,1,"-",1,null,"X",0,2,"-",2,null,"X",0,2,"-",2,null,"X",0,3,"-",0,null,1,0,2,"-",0,null,1,0,2,"-",1,null,1,0]
["2018-06-21","Kl 17.00","Frankrike","-","Peru"," ","-",null,null,0,1,"-",0,null,1,0,2,"-",3,null,2,0,2,"-",0,null,1,0,3,"-",1,null,1,0,0,"-",2,null,2,0,3,"-",0,null,1,0,2,"-",0,null,1,0,3,"-",1,null,1,0,2,"-",1,null,1,0,3,"-",0,null,1,0,2,"-",2,null,"X",0,2,"-",1,null,1,0,3,"-",1,null,1,0,2,"-",1,null,1,0,4,"-",1,null,1,0,2,"-",0,null,1,0,2,"-",0,null,1,0,2,"-",1,null,1,0,2,"-",0,null,1,0,4,"-",0,null,1,0,3,"-",0,null,1,0,3,"-",1,null,1,0,2,"-",2,null,"X",0,4,"-",0,null,1,0,3,"-",1,null,1,0,2,"-",0,null,1,0,4,"-",1,null,1,0,3,"-",0,null,1,0,2,"-",1,null,1,0,1,"-",0,null,1,0,3,"-",1,null,1,0,1,"-",1,null,"X",0,2,"-",1,null,1,0,3,"-",2,null,1,0,4,"-",1,null,1,0,2,"-",1,null,1,0,2,"-",0,null,1,0,2,"-",1,null,1,0,1,"-",1,null,"X",0,1,"-",1,null,"X",0,2,"-",0,null,1,0,1,"-",1,null,"X",0,2,"-",0,null,1,0,3,"-",1,null,1,0,2,"-",2,null,"X",0,3,"-",1,null,1,0,7,"-",1,null,1,0,1,"-",3,null,2,0,1,"-",4,null,2,0,3,"-",1,null,1,0,1,"-",1,null,"X",0,2,"-",0,null,1,0,2,"-",0,null,1,0,2,"-",0,null,1,0,2,"-",0,null,1,0,1,"-",0,null,1,0]
["2018-06-21","Kl 20.00","Argentina","-","Kroatien"," ","-",null,null,0,2,"-",0,null,1,0,3,"-",1,null,1,0,1,"-",0,null,1,0,3,"-",1,null,1,0,1,"-",2,null,2,0,2,"-",1,null,1,0,1,"-",1,null,"X",0,0,"-",0,null,"X",0,2,"-",2,null,"X",0,2,"-",2,null,"X",0,2,"-",0,null,1,0,3,"-",1,null,1,0,2,"-",3,null,2,0,3,"-",0,null,1,0,5,"-",0,null,1,0,1,"-",1,null,"X",0,1,"-",1,null,"X",0,0,"-",2,null,2,0,2,"-",2,null,"X",0,3,"-",2,null,1,0,3,"-",1,null,1,0,2,"-",1,null,1,0,1,"-",3,null,2,0,3,"-",1,null,1,0,2,"-",1,null,1,0,1,"-",1,null,"X",0,1,"-",2,null,2,0,1,"-",2,null,2,0,2,"-",1,null,1,0,2,"-",0,null,1,0,1,"-",0,null,1,0,2,"-",0,null,1,0,1,"-",1,null,"X",0,4,"-",1,null,1,0,3,"-",3,null,"X",0,2,"-",0,null,1,0,2,"-",0,null,1,0,3,"-",1,null,1,0,1,"-",1,null,"X",0,0,"-",0,null,"X",0,3,"-",1,null,1,0,2,"-",1,null,1,0,0,"-",1,null,2,0,0,"-",0,null,"X",0,1,"-",2,null,2,0,2,"-",1,null,1,0,1,"-",4,null,2,0,1,"-",3,null,2,0,1,"-",3,null,2,0,2,"-",1,null,1,0,1,"-",1,null,"X",0,1,"-",1,null,"X",0,2,"-",1,null,1,0,1,"-",0,null,1,0,3,"-",0,null,1,0,2,"-",2,null,"X",0]
["2018-06-22","Kl 14.00","Brasilien","-","Costa Rica"," ","-",null,null,0,3,"-",0,null,{"$f":"IF(K25=M25,\"X\",IF(K25>M25,1,2))","v":1},0,1,"-",0,null,1,0,2,"-",1,null,1,0,3,"-",1,null,{"$f":"IF(AC25=AE25,\"X\",IF(AC25>AE25,1,2))","v":1},0,3,"-",1,null,{"$f":"IF(AI25=AK25,\"X\",IF(AI25>AK25,1,2))","v":1},0,3,"-",0,null,{"$f":"IF(AO25=AQ25,\"X\",IF(AO25>AQ25,1,2))","v":1},0,3,"-",0,null,{"$f":"IF(AU25=AW25,\"X\",IF(AU25>AW25,1,2))","v":1},0,4,"-",1,null,{"$f":"IF(BA25=BC25,\"X\",IF(BA25>BC25,1,2))","v":1},0,4,"-",0,null,{"$f":"IF(BG25=BI25,\"X\",IF(BG25>BI25,1,2))","v":1},0,3,"-",1,null,{"$f":"IF(BM25=BO25,\"X\",IF(BM25>BO25,1,2))","v":1},0,5,"-",2,null,{"$f":"IF(BS25=BU25,\"X\",IF(BS25>BU25,1,2))","v":1},0,2,"-",0,null,{"$f":"IF(BY25=CA25,\"X\",IF(BY25>CA25,1,2))","v":1},0,4,"-",1,null,{"$f":"IF(CE25=CG25,\"X\",IF(CE25>CG25,1,2))","v":1},0,3,"-",1,null,{"$f":"IF(CK25=CM25,\"X\",IF(CK25>CM25,1,2))","v":1},0,4,"-",0,null,{"$f":"IF(CQ25=CS25,\"X\",IF(CQ25>CS25,1,2))","v":1},0,2,"-",0,null,{"$f":"IF(CW25=CY25,\"X\",IF(CW25>CY25,1,2))","v":1},0,2,"-",1,null,{"$f":"IF(DC25=DE25,\"X\",IF(DC25>DE25,1,2))","v":1},0,3,"-",2,null,1,0,1,"-",0,null,1,0,2,"-",1,null,{"$f":"IF(DU25=DW25,\"X\",IF(DU25>DW25,1,2))","v":1},0,2,"-",0,null,{"$f":"IF(EA25=EC25,\"X\",IF(EA25>EC25,1,2))","v":1},0,3,"-",1,null,{"$f":"IF(EG25=EI25,\"X\",IF(EG25>EI25,1,2))","v":1},0,3,"-",1,null,{"$f":"IF(EM25=EO25,\"X\",IF(EM25>EO25,1,2))","v":1},0,4,"-",0,null,{"$f":"IF(ES25=EU25,\"X\",IF(ES25>EU25,1,2))","v":1},0,3,"-",2,null,{"$f":"IF(EY25=FA25,\"X\",IF(EY25>FA25,1,2))","v":1},0,3,"-",0,null,{"$f":"IF(FE25=FG25,\"X\",IF(FE25>FG25,1,2))","v":1},0,2,"-",0,null,{"$f":"IF(FK25=FM25,\"X\",IF(FK25>FM25,1,2))","v":1},0,2,"-",0,null,{"$f":"IF(FQ25=FS25,\"X\",IF(FQ25>FS25,1,2))","v":1},0,2,"-",1,null,{"$f":"IF(FW25=FY25,\"X\",IF(FW25>FY25,1,2))","v":1},0,3,"-",0,null,{"$f":"IF(GC25=GE25,\"X\",IF(GC25>GE25,1,2))","v":1},0,2,"-",0,null,{"$f":"IF(GI25=GK25,\"X\",IF(GI25>GK25,1,2))","v":1},0,2,"-",1,null,{"$f":"IF(GO25=GQ25,\"X\",IF(GO25>GQ25,1,2))","v":1},0,2,"-",1,null,{"$f":"IF(GU25=GW25,\"X\",IF(GU25>GW25,1,2))","v":1},0,4,"-",1,null,{"$f":"IF(HA25=HC25,\"X\",IF(HA25>HC25,1,2))","v":1},0,2,"-",3,null,{"$f":"IF(HG25=HI25,\"X\",IF(HG25>HI25,1,2))","v":2},0,2,"-",0,null,{"$f":"IF(HM25=HO25,\"X\",IF(HM25>HO25,1,2))","v":1},0,2,"-",0,null,1,0,2,"-",2,null,"X",0,2,"-",1,null,1,0,1,"-",0,null,1,0,3,"-",0,null,1,0,3,"-",0,null,1,0,2,"-",2,null,"X",0,3,"-",0,null,1,0,3,"-",2,null,1,0,3,"-",1,null,1,0,4,"-",4,null,"X",0,4,"-",2,null,1,0,4,"-",4,null,"X",0,3,"-",1,null,1,0,2,"-",1,null,1,0,2,"-",0,null,1,0,2,"-",0,null,1,0,1,"-",3,null,2,0,2,"-",1,null,1,0,3,"-",1,null,1,0]
["2018-06-22","Kl 17.00","Nigeria",{"$f":"D25","v":"-"},"Island"," ","-",null,null,{"$f":"IF(F26=\" \",0,IF(F26=H26,\"X\",IF(F26>H26,1,2)))","v":0},0,"-",1,null,2,0,0,"-",3,null,2,0,2,"-",1,null,1,0,2,"-",2,null,"X",0,0,"-",2,null,2,0,0,"-",3,null,2,0,4,"-",2,null,1,0,3,"-",1,null,1,0,1,"-",1,null,"X",0,0,"-",0,null,"X",0,1,"-",0,null,1,0,1,"-",2,null,2,0,1,"-",0,null,1,0,1,"-",2,null,2,0,0,"-",1,null,2,0,2,"-",0,null,1,0,0,"-",1,null,2,0,1,"-",1,null,"X",0,0,"-",1,null,2,0,0,"-",1,null,2,0,1,"-",1,null,"X",0,0,"-",1,null,2,0,4,"-",3,null,1,0,3,"-",1,null,1,0,1,"-",1,null,"X",0,2,"-",1,null,1,0,1,"-",0,null,1,0,0,"-",0,null,"X",0,1,"-",2,null,2,0,1,"-",1,null,"X",0,1,"-",1,null,"X",0,1,"-",2,null,2,0,1,"-",1,null,"X",0,2,"-",2,null,"X",0,2,"-",4,null,2,0,0,"-",1,null,2,0,1,"-",1,null,"X",0,0,"-",1,null,2,0,2,"-",2,null,"X",0,2,"-",0,null,1,0,1,"-",0,null,1,0,2,"-",1,null,1,0,0,"-",0,null,"X",0,1,"-",2,null,2,0,2,"-",2,null,"X",0,0,"-",1,null,2,0,5,"-",4,null,1,0,6,"-",0,null,1,0,3,"-",2,null,1,0,2,"-",0,null,1,0,2,"-",2,null,"X",0,2,"-",0,null,1,0,1,"-",1,null,"X",0,1,"-",1,null,"X",0,2,"-",0,null,1,0,1,"-",1,null,"X",0]
["2018-06-22","Kl 20.00","Serbien","-","Schweiz"," ","-",null,null,0,0,"-",1,null,2,{"$f":"IF($F27=K27,IF($H27=M27,5,IF($J27=O27,3,0)),IF($J27=O27,3,0))","v":0},3,"-",2,null,1,{"$f":"IF($F27=Q27,IF($H27=S27,5,IF($J27=U27,3,0)),IF($J27=U27,3,0))","v":0},0,"-",1,null,2,{"$f":"IF($F27=W27,IF($H27=Y27,5,IF($J27=AA27,3,0)),IF($J27=AA27,3,0))","v":0},1,"-",1,null,"X",{"$f":"IF($F27=AC27,IF($H27=AE27,5,IF($J27=AG27,3,0)),IF($J27=AG27,3,0))","v":0},0,"-",1,null,2,{"$f":"IF($F27=AI27,IF($H27=AK27,5,IF($J27=AM27,3,0)),IF($J27=AM27,3,0))","v":0},0,"-",0,null,"X",{"$f":"IF($F27=AO27,IF($H27=AQ27,5,IF($J27=AS27,3,0)),IF($J27=AS27,3,0))","v":0},1,"-",1,null,"X",{"$f":"IF($F27=AU27,IF($H27=AW27,5,IF($J27=AY27,3,0)),IF($J27=AY27,3,0))","v":0},0,"-",0,null,"X",{"$f":"IF($F27=BA27,IF($H27=BC27,5,IF($J27=BE27,3,0)),IF($J27=BE27,3,0))","v":0},1,"-",2,null,2,{"$f":"IF($F27=BG27,IF($H27=BI27,5,IF($J27=BK27,3,0)),IF($J27=BK27,3,0))","v":0},2,"-",1,null,1,{"$f":"IF($F27=BM27,IF($H27=BO27,5,IF($J27=BQ27,3,0)),IF($J27=BQ27,3,0))","v":0},1,"-",3,null,2,{"$f":"IF($F27=BS27,IF($H27=BU27,5,IF($J27=BW27,3,0)),IF($J27=BW27,3,0))","v":0},3,"-",2,null,1,{"$f":"IF($F27=BY27,IF($H27=CA27,5,IF($J27=CC27,3,0)),IF($J27=CC27,3,0))","v":0},2,"-",0,null,1,{"$f":"IF($F27=CE27,IF($H27=CG27,5,IF($J27=CI27,3,0)),IF($J27=CI27,3,0))","v":0},1,"-",1,null,"X",{"$f":"IF($F27=CK27,IF($H27=CM27,5,IF($J27=CO27,3,0)),IF($J27=CO27,3,0))","v":0},2,"-",0,null,1,{"$f":"IF($F27=CQ27,IF($H27=CS27,5,IF($J27=CU27,3,0)),IF($J27=CU27,3,0))","v":0},1,"-",1,null,"X",{"$f":"IF($F27=CW27,IF($H27=CY27,5,IF($J27=DA27,3,0)),IF($J27=DA27,3,0))","v":0},1,"-",1,null,"X",{"$f":"IF($F27=DC27,IF($H27=DE27,5,IF($J27=DG27,3,0)),IF($J27=DG27,3,0))","v":0},1,"-",1,null,"X",0,2,"-",1,null,1,0,1,"-",1,null,"X",{"$f":"IF($F27=DU27,IF($H27=DW27,5,IF($J27=DY27,3,0)),IF($J27=DY27,3,0))","v":0},1,"-",1,null,"X",{"$f":"IF($F27=EA27,IF($H27=EC27,5,IF($J27=EE27,3,0)),IF($J27=EE27,3,0))","v":0},0,"-",1,null,2,{"$f":"IF($F27=EG27,IF($H27=EI27,5,IF($J27=EK27,3,0)),IF($J27=EK27,3,0))","v":0},2,"-",2,null,"X",{"$f":"IF($F27=EM27,IF($H27=EO27,5,IF($J27=EQ27,3,0)),IF($J27=EQ27,3,0))","v":0},1,"-",0,null,1,{"$f":"IF($F27=ES27,IF($H27=EU27,5,IF($J27=EW27,3,0)),IF($J27=EW27,3,0))","v":0},0,"-",2,null,2,{"$f":"IF($F27=EY27,IF($H27=FA27,5,IF($J27=FC27,3,0)),IF($J27=FC27,3,0))","v":0},1,"-",1,null,"X",{"$f":"IF($F27=FE27,IF($H27=FG27,5,IF($J27=FI27,3,0)),IF($J27=FI27,3,0))","v":0},2,"-",0,null,1,{"$f":"IF($F27=FK27,IF($H27=FM27,5,IF($J27=FO27,3,0)),IF($J27=FO27,3,0))","v":0},0,"-",1,null,2,{"$f":"IF($F27=FQ27,IF($H27=FS27,5,IF($J27=FU27,3,0)),IF($J27=FU27,3,0))","v":0},0,"-",1,null,2,{"$f":"IF($F27=FW27,IF($H27=FY27,5,IF($J27=GA27,3,0)),IF($J27=GA27,3,0))","v":0},1,"-",1,null,"X",{"$f":"IF($F27=GC27,IF($H27=GE27,5,IF($J27=GG27,3,0)),IF($J27=GG27,3,0))","v":0},0,"-",0,null,"X",{"$f":"IF($F27=GI27,IF($H27=GK27,5,IF($J27=GM27,3,0)),IF($J27=GM27,3,0))","v":0},1,"-",2,null,2,{"$f":"IF($F27=GO27,IF($H27=GQ27,5,IF($J27=GS27,3,0)),IF($J27=GS27,3,0))","v":0},1,"-",1,null,"X",{"$f":"IF($F27=GU27,IF($H27=GW27,5,IF($J27=GY27,3,0)),IF($J27=GY27,3,0))","v":0},2,"-",0,null,1,{"$f":"IF($F27=HA27,IF($H27=HC27,5,IF($J27=HE27,3,0)),IF($J27=HE27,3,0))","v":0},1,"-",1,null,"X",{"$f":"IF($F27=HG27,IF($H27=HI27,5,IF($J27=HK27,3,0)),IF($J27=HK27,3,0))","v":0},1,"-",2,null,2,{"$f":"IF($F27=HM27,IF($H27=HO27,5,IF($J27=HQ27,3,0)),IF($J27=HQ27,3,0))","v":0},2,"-",0,null,1,0,1,"-",1,null,"X",0,0,"-",1,null,2,0,2,"-",2,null,"X",0,1,"-",2,null,2,0,1,"-",1,null,"X",0,1,"-",1,null,"X",0,1,"-",1,null,"X",0,0,"-",0,null,"X",0,0,"-",1,null,2,0,1,"-",3,null,2,0,1,"-",3,null,2,0,2,"-",3,null,2,0,1,"-",1,null,"X",0,1,"-",1,null,"X",0,0,"-",0,null,"X",0,2,"-",1,null,1,0,0,"-",0,null,"X",0,1,"-",1,null,"X",0,0,"-",1,null,2,0]
["2018-06-23","Kl 14.00","Belgien","-","Tunisien"," ","-",null,null,0,2,"-",0,null,1,0,2,"-",0,null,1,0,2,"-",0,null,1,0,2,"-",2,null,"X",0,3,"-",0,null,1,0,1,"-",0,null,1,0,2,"-",0,null,1,0,1,"-",0,null,1,0,1,"-",0,null,1,0,2,"-",2,null,"X",0,2,"-",0,null,1,0,2,"-",0,null,1,0,3,"-",1,null,1,0,0,"-",0,null,"X",0,3,"-",1,null,1,0,0,"-",0,null,"X",0,1,"-",1,null,"X",0,2,"-",1,null,1,0,3,"-",1,null,1,0,1,"-",0,null,1,0,2,"-",0,null,1,0,0,"-",1,null,2,0,2,"-",1,null,1,0,3,"-",0,null,1,0,3,"-",1,null,1,0,3,"-",1,null,1,0,5,"-",0,null,1,0,2,"-",0,null,1,0,1,"-",0,null,1,0,2,"-",0,null,1,0,4,"-",1,null,1,0,2,"-",0,null,1,0,2,"-",1,null,1,0,3,"-",1,null,1,0,3,"-",0,null,1,0,2,"-",0,null,1,0,0,"-",0,null,"X",0,1,"-",1,null,"X",0,0,"-",2,null,2,0,3,"-",1,null,1,0,2,"-",0,null,1,0,2,"-",0,null,1,0,2,"-",0,null,1,0,2,"-",1,null,1,0,0,"-",2,null,2,0,0,"-",1,null,2,0,1,"-",1,null,"X",0,3,"-",1,null,1,0,1,"-",4,null,2,0,2,"-",0,null,1,0,2,"-",1,null,1,0,3,"-",0,null,1,0,2,"-",0,null,1,0,1,"-",1,null,"X",0,2,"-",1,null,1,0,0,"-",0,null,"X",0]
["2018-06-23","Kl 17.00","Sydkorea","-","Mexiko"," ","-",null,null,0,2,"-",2,null,"X",0,0,"-",1,null,2,0,0,"-",1,null,2,0,2,"-",1,null,1,0,3,"-",0,null,1,0,0,"-",2,null,2,0,0,"-",3,null,2,0,0,"-",2,null,2,0,1,"-",3,null,2,0,2,"-",1,null,1,0,0,"-",3,null,2,0,2,"-",2,null,"X",0,1,"-",3,null,2,0,1,"-",1,null,"X",0,0,"-",2,null,2,0,0,"-",2,null,2,0,1,"-",2,null,2,0,1,"-",1,null,"X",0,2,"-",2,null,"X",0,0,"-",1,null,2,0,0,"-",2,null,2,0,2,"-",1,null,1,0,1,"-",2,null,2,0,1,"-",2,null,2,0,0,"-",0,null,"X",0,1,"-",3,null,2,0,1,"-",3,null,2,0,1,"-",1,null,"X",0,0,"-",1,null,2,0,0,"-",2,null,2,0,1,"-",3,null,2,0,0,"-",1,null,2,0,1,"-",2,null,2,0,0,"-",2,null,2,0,4,"-",2,null,1,0,0,"-",1,null,2,0,2,"-",1,null,1,0,1,"-",1,null,"X",0,0,"-",0,null,"X",0,1,"-",2,null,2,0,1,"-",1,null,"X",0,1,"-",1,null,"X",0,0,"-",1,null,2,0,1,"-",1,null,"X",0,1,"-",2,null,2,0,2,"-",1,null,1,0,1,"-",1,null,"X",0,2,"-",3,null,2,0,3,"-",3,null,"X",0,1,"-",2,null,2,0,1,"-",1,null,"X",0,0,"-",2,null,2,0,0,"-",1,null,2,0,1,"-",3,null,2,0,1,"-",2,null,2,0,2,"-",1,null,1,0]
["2018-06-23","Kl 20.00","Tyskland","-","Sverige"," ","-",null,null,0,1,"-",2,null,2,0,1,"-",0,null,1,0,2,"-",0,null,1,0,2,"-",2,null,"X",0,1,"-",0,null,1,0,2,"-",1,null,1,0,2,"-",0,null,1,0,4,"-",0,null,1,0,2,"-",1,null,1,0,3,"-",2,null,1,0,3,"-",0,null,1,0,2,"-",1,null,1,0,2,"-",3,null,2,0,1,"-",1,null,"X",0,2,"-",3,null,2,0,1,"-",1,null,"X",0,3,"-",1,null,1,0,2,"-",1,null,1,0,2,"-",1,null,1,0,3,"-",0,null,1,0,1,"-",1,null,"X",0,2,"-",2,null,"X",0,3,"-",1,null,1,0,3,"-",1,null,1,0,1,"-",1,null,"X",0,3,"-",1,null,1,0,4,"-",0,null,1,0,1,"-",2,null,2,0,2,"-",0,null,1,0,3,"-",1,null,1,0,5,"-",1,null,1,0,2,"-",1,null,1,0,2,"-",0,null,1,0,4,"-",3,null,1,0,4,"-",3,null,1,0,2,"-",0,null,1,0,1,"-",1,null,"X",0,0,"-",1,null,2,0,1,"-",0,null,1,0,1,"-",0,null,1,0,2,"-",1,null,1,0,2,"-",0,null,1,0,1,"-",1,null,"X",0,2,"-",1,null,1,0,2,"-",3,null,2,0,2,"-",2,null,"X",0,3,"-",2,null,1,0,1,"-",1,null,"X",0,3,"-",3,null,"X",0,2,"-",1,null,1,0,0,"-",0,null,"X",0,3,"-",1,null,1,0,2,"-",0,null,1,0,2,"-",0,null,1,0,0,"-",1,null,2,0,1,"-",2,null,2,0]
["2018-06-24","Kl 14.00","England","-","Panama"," ","-",null,null,0,2,"-",0,null,1,0,0,"-",2,null,2,0,1,"-",0,null,1,0,3,"-",1,null,1,0,0,"-",2,null,2,0,2,"-",0,null,1,0,3,"-",0,null,1,0,3,"-",0,null,1,0,3,"-",0,null,1,0,2,"-",0,null,1,0,1,"-",1,null,"X",0,3,"-",0,null,1,0,3,"-",1,null,1,0,2,"-",0,null,1,0,4,"-",1,null,1,0,2,"-",0,null,1,0,1,"-",0,null,1,0,2,"-",0,null,1,0,3,"-",1,null,1,0,1,"-",0,null,1,0,2,"-",1,null,1,0,1,"-",0,null,1,0,4,"-",2,null,1,0,3,"-",0,null,1,0,1,"-",0,null,1,0,3,"-",0,null,1,0,6,"-",0,null,1,0,1,"-",0,null,1,0,1,"-",1,null,"X",0,3,"-",0,null,1,0,3,"-",1,null,1,0,2,"-",0,null,1,0,1,"-",0,null,1,0,3,"-",1,null,1,0,3,"-",1,null,1,0,3,"-",0,null,1,0,2,"-",0,null,1,0,1,"-",1,null,"X",0,1,"-",0,null,1,0,2,"-",0,null,1,0,3,"-",1,null,1,0,2,"-",0,null,1,0,2,"-",0,null,1,0,2,"-",0,null,1,0,3,"-",1,null,1,0,1,"-",0,null,1,0,4,"-",1,null,1,0,4,"-",4,null,"X",0,1,"-",5,null,2,0,3,"-",0,null,1,0,2,"-",0,null,1,0,1,"-",0,null,1,0,2,"-",0,null,1,0,3,"-",1,null,1,0,3,"-",1,null,1,0,3,"-",1,null,1,0]
["2018-06-24","Kl 17.00","Japan","-","Senegal"," ","-",null,null,0,0,"-",1,null,2,0,2,"-",2,null,"X",0,0,"-",0,null,"X",0,1,"-",1,null,"X",0,1,"-",0,null,1,0,1,"-",0,null,1,0,1,"-",1,null,"X",0,2,"-",2,null,"X",0,2,"-",2,null,"X",0,0,"-",0,null,"X",0,1,"-",2,null,2,0,1,"-",2,null,2,0,2,"-",1,null,1,0,1,"-",0,null,1,0,1,"-",1,null,"X",0,0,"-",1,null,2,0,0,"-",2,null,2,0,2,"-",1,null,1,0,2,"-",2,null,"X",0,0,"-",0,null,"X",0,1,"-",1,null,"X",0,1,"-",2,null,2,0,1,"-",0,null,1,0,1,"-",1,null,"X",0,2,"-",2,null,"X",0,1,"-",2,null,2,0,1,"-",1,null,"X",0,2,"-",1,null,1,0,1,"-",2,null,2,0,0,"-",0,null,"X",0,1,"-",1,null,"X",0,1,"-",3,null,2,0,1,"-",1,null,"X",0,2,"-",2,null,"X",0,2,"-",2,null,"X",0,2,"-",0,null,1,0,1,"-",1,null,"X",0,0,"-",2,null,2,0,2,"-",1,null,1,0,1,"-",1,null,"X",0,1,"-",1,null,"X",0,1,"-",1,null,"X",0,0,"-",0,null,"X",0,1,"-",1,null,"X",0,0,"-",1,null,2,0,1,"-",2,null,2,0,4,"-",0,null,1,0,1,"-",2,null,2,0,2,"-",1,null,1,0,1,"-",2,null,2,0,1,"-",0,null,1,0,0,"-",2,null,2,0,1,"-",0,null,1,0,1,"-",0,null,1,0,1,"-",2,null,2,0,2,"-",2,null,"X",0]
["2018-06-24","Kl 20.00","Polen","-","Colombia"," ","-",null,null,0,0,"-",1,null,2,0,2,"-",1,null,1,0,0,"-",1,null,2,0,1,"-",2,null,2,0,2,"-",1,null,1,0,2,"-",0,null,1,0,1,"-",2,null,2,0,0,"-",3,null,2,0,0,"-",0,null,"X",0,2,"-",2,null,"X",0,1,"-",2,null,2,0,2,"-",1,null,1,0,1,"-",1,null,"X",0,1,"-",1,null,"X",0,2,"-",2,null,"X",0,1,"-",1,null,"X",0,1,"-",1,null,"X",0,2,"-",1,null,1,0,2,"-",1,null,1,0,0,"-",1,null,2,0,0,"-",1,null,2,0,1,"-",2,null,2,0,0,"-",0,null,"X",0,1,"-",2,null,2,0,0,"-",1,null,2,0,1,"-",0,null,1,0,3,"-",2,null,1,0,1,"-",1,null,"X",0,1,"-",1,null,"X",0,1,"-",0,null,1,0,1,"-",0,null,1,0,1,"-",1,null,"X",0,1,"-",1,null,"X",0,1,"-",1,null,"X",0,3,"-",2,null,1,0,2,"-",0,null,1,0,1,"-",1,null,"X",0,0,"-",1,null,2,0,2,"-",1,null,1,0,0,"-",0,null,"X",0,1,"-",2,null,2,0,1,"-",1,null,"X",0,0,"-",0,null,"X",0,1,"-",1,null,"X",0,2,"-",2,null,"X",0,1,"-",2,null,2,0,3,"-",0,null,1,0,3,"-",3,null,"X",0,1,"-",2,null,2,0,2,"-",1,null,1,0,2,"-",2,null,"X",0,0,"-",1,null,2,0,1,"-",2,null,2,0,2,"-",1,null,1,0,1,"-",1,null,"X",0,1,"-",2,null,2,0]
["2018-06-25","Kl 16.00","Saudiarbien","-","Egypten"," ","-",null,null,0,1,"-",2,null,2,0,1,"-",0,null,1,0,1,"-",2,null,2,0,0,"-",0,null,"X",0,2,"-",1,null,1,0,1,"-",1,null,"X",0,0,"-",4,null,2,0,1,"-",2,null,2,0,1,"-",3,null,2,0,2,"-",1,null,1,0,0,"-",2,null,2,0,1,"-",3,null,2,0,2,"-",2,null,"X",0,1,"-",1,null,"X",0,3,"-",1,null,1,0,0,"-",1,null,2,0,1,"-",1,null,"X",0,1,"-",1,null,"X",0,0,"-",1,null,2,0,1,"-",2,null,2,0,0,"-",0,null,"X",0,0,"-",3,null,2,0,3,"-",3,null,"X",0,0,"-",1,null,2,0,2,"-",2,null,"X",0,1,"-",1,null,"X",0,1,"-",3,null,2,0,1,"-",1,null,"X",0,2,"-",2,null,"X",0,0,"-",2,null,2,0,0,"-",1,null,2,0,1,"-",1,null,"X",0,0,"-",0,null,"X",0,2,"-",2,null,"X",0,1,"-",1,null,"X",0,1,"-",1,null,"X",0,0,"-",0,null,"X",0,1,"-",3,null,2,0,3,"-",1,null,1,0,0,"-",0,null,"X",0,2,"-",2,null,"X",0,0,"-",0,null,"X",0,1,"-",1,null,"X",0,2,"-",1,null,1,0,3,"-",0,null,1,0,0,"-",3,null,2,0,0,"-",3,null,2,0,2,"-",2,null,"X",0,0,"-",3,null,2,0,1,"-",3,null,2,0,0,"-",0,null,"X",0,1,"-",1,null,"X",0,0,"-",2,null,2,0,1,"-",1,null,"X",0,0,"-",0,null,"X",0,2,"-",3,null,2,0]
["2018-06-25","Kl 16.00","Uruguay","-","Ryssland"," ","-",null,null,0,0,"-",0,null,"X",0,0,"-",2,null,2,0,0,"-",2,null,2,0,1,"-",2,null,2,0,0,"-",2,null,2,0,0,"-",3,null,2,0,0,"-",0,null,"X",0,1,"-",1,null,"X",0,0,"-",1,null,2,0,3,"-",2,null,1,0,1,"-",2,null,2,0,2,"-",3,null,2,0,1,"-",2,null,2,0,2,"-",2,null,"X",0,2,"-",3,null,2,0,2,"-",1,null,1,0,1,"-",1,null,"X",0,0,"-",2,null,2,0,1,"-",2,null,2,0,2,"-",1,null,1,0,1,"-",0,null,1,0,0,"-",1,null,2,0,1,"-",3,null,2,0,3,"-",2,null,1,0,2,"-",1,null,1,0,1,"-",0,null,1,0,1,"-",2,null,2,0,0,"-",0,null,"X",0,2,"-",1,null,1,0,1,"-",1,null,"X",0,1,"-",0,null,1,0,1,"-",2,null,2,0,2,"-",1,null,1,0,1,"-",2,null,2,0,2,"-",3,null,2,0,2,"-",1,null,1,0,2,"-",2,null,"X",0,1,"-",2,null,2,0,0,"-",3,null,2,0,1,"-",1,null,"X",0,1,"-",1,null,"X",0,1,"-",0,null,1,0,0,"-",0,null,"X",0,1,"-",2,null,2,0,2,"-",2,null,"X",0,0,"-",1,null,2,0,0,"-",7,null,2,0,2,"-",2,null,"X",0,1,"-",0,null,1,0,2,"-",2,null,"X",0,1,"-",1,null,"X",0,1,"-",2,null,2,0,2,"-",0,null,1,0,1,"-",3,null,2,0,1,"-",2,null,2,0,1,"-",1,null,"X",0]
["2018-06-25","Kl 20.00","Spanien","-","Marocko"," ","-",null,null,0,2,"-",0,null,1,0,2,"-",1,null,1,0,2,"-",1,null,1,0,3,"-",1,null,1,0,0,"-",1,null,2,0,2,"-",0,null,1,0,2,"-",0,null,1,0,4,"-",0,null,1,0,4,"-",2,null,1,0,4,"-",1,null,1,0,2,"-",0,null,1,0,4,"-",1,null,1,0,3,"-",1,null,1,0,2,"-",0,null,1,0,3,"-",0,null,1,0,2,"-",0,null,1,0,2,"-",0,null,1,0,2,"-",1,null,1,0,3,"-",1,null,1,0,2,"-",0,null,1,0,3,"-",1,null,1,0,3,"-",0,null,1,0,2,"-",3,null,2,0,3,"-",0,null,1,0,3,"-",1,null,1,0,4,"-",1,null,1,0,3,"-",0,null,1,0,2,"-",0,null,1,0,3,"-",0,null,1,0,2,"-",0,null,1,0,2,"-",0,null,1,0,2,"-",1,null,1,0,2,"-",1,null,1,0,4,"-",1,null,1,0,3,"-",1,null,1,0,3,"-",0,null,1,0,2,"-",0,null,1,0,1,"-",1,null,"X",0,1,"-",0,null,1,0,2,"-",0,null,1,0,2,"-",0,null,1,0,2,"-",0,null,1,0,3,"-",0,null,1,0,2,"-",0,null,1,0,2,"-",0,null,1,0,3,"-",0,null,1,0,5,"-",1,null,1,0,1,"-",3,null,2,0,4,"-",1,null,1,0,4,"-",2,null,1,0,3,"-",1,null,1,0,2,"-",0,null,1,0,2,"-",0,null,1,0,1,"-",2,null,2,0,3,"-",0,null,1,0,3,"-",0,null,1,0]
["2018-06-25","Kl 20.00","Iran","-","Portugal"," ","-",null,null,0,0,"-",2,null,2,0,1,"-",0,null,1,0,0,"-",1,null,2,0,1,"-",4,null,2,0,0,"-",1,null,2,0,0,"-",2,null,2,0,0,"-",4,null,2,0,0,"-",2,null,2,0,1,"-",3,null,2,0,1,"-",3,null,2,0,0,"-",2,null,2,0,1,"-",3,null,2,0,1,"-",0,null,1,0,1,"-",1,null,"X",0,0,"-",4,null,2,0,0,"-",3,null,2,0,0,"-",1,null,2,0,1,"-",2,null,2,0,0,"-",2,null,2,0,1,"-",3,null,2,0,1,"-",2,null,2,0,1,"-",2,null,2,0,0,"-",1,null,2,0,0,"-",3,null,2,0,0,"-",3,null,2,0,0,"-",1,null,2,0,0,"-",2,null,2,0,0,"-",3,null,2,0,1,"-",2,null,2,0,0,"-",3,null,2,0,0,"-",3,null,2,0,0,"-",2,null,2,0,0,"-",2,null,2,0,1,"-",2,null,2,0,2,"-",3,null,2,0,0,"-",2,null,2,0,2,"-",2,null,"X",0,1,"-",1,null,"X",0,0,"-",1,null,2,0,0,"-",3,null,2,0,1,"-",3,null,2,0,0,"-",1,null,2,0,1,"-",2,null,2,0,0,"-",2,null,2,0,0,"-",3,null,2,0,1,"-",2,null,2,0,1,"-",4,null,2,0,2,"-",4,null,2,0,1,"-",3,null,2,0,1,"-",3,null,2,0,0,"-",2,null,2,0,0,"-",3,null,2,0,0,"-",1,null,2,0,1,"-",3,null,2,0,1,"-",1,null,"X",0,1,"-",4,null,2,0]
["2018-06-26","Kl 16.00","Danmark","-","Frankrike"," ","-",null,null,0,1,"-",2,null,2,0,0,"-",1,null,2,0,0,"-",2,null,2,0,1,"-",3,null,2,0,0,"-",1,null,2,0,1,"-",3,null,2,0,2,"-",2,null,"X",0,1,"-",1,null,"X",0,1,"-",2,null,2,0,2,"-",4,null,2,0,1,"-",3,null,2,0,2,"-",2,null,"X",0,1,"-",1,null,"X",0,1,"-",1,null,"X",0,2,"-",1,null,1,0,1,"-",2,null,2,0,1,"-",1,null,"X",0,1,"-",2,null,2,0,1,"-",3,null,2,0,3,"-",1,null,1,0,1,"-",1,null,"X",0,2,"-",3,null,2,0,0,"-",2,null,2,0,1,"-",3,null,2,0,0,"-",2,null,2,0,1,"-",2,null,2,0,0,"-",1,null,2,0,0,"-",1,null,2,0,0,"-",1,null,2,0,1,"-",3,null,2,0,0,"-",1,null,2,0,1,"-",1,null,"X",0,1,"-",1,null,"X",0,0,"-",1,null,2,0,3,"-",2,null,1,0,0,"-",2,null,2,0,2,"-",2,null,"X",0,1,"-",0,null,1,0,0,"-",1,null,2,0,1,"-",1,null,"X",0,1,"-",3,null,2,0,1,"-",1,null,"X",0,1,"-",2,null,2,0,1,"-",1,null,"X",0,1,"-",3,null,2,0,2,"-",3,null,2,0,1,"-",1,null,"X",0,5,"-",4,null,1,0,1,"-",1,null,"X",0,2,"-",3,null,2,0,1,"-",1,null,"X",0,0,"-",2,null,2,0,1,"-",2,null,2,0,2,"-",0,null,1,0,2,"-",1,null,1,0,1,"-",2,null,2,0]
["2018-06-26","Kl 16.00","Australien","-","Peru"," ","-",null,null,0,1,"-",0,null,1,0,1,"-",0,null,1,0,0,"-",1,null,2,0,3,"-",1,null,1,0,1,"-",0,null,1,0,0,"-",1,null,2,0,1,"-",0,null,1,0,2,"-",0,null,1,0,0,"-",1,null,2,0,2,"-",2,null,"X",0,1,"-",0,null,1,0,1,"-",0,null,1,0,2,"-",1,null,1,0,0,"-",0,null,"X",0,2,"-",2,null,"X",0,1,"-",1,null,"X",0,2,"-",3,null,2,0,2,"-",1,null,1,0,1,"-",0,null,1,0,1,"-",0,null,1,0,0,"-",0,null,"X",0,2,"-",1,null,1,0,1,"-",1,null,"X",0,1,"-",1,null,"X",0,0,"-",2,null,2,0,1,"-",0,null,1,0,1,"-",1,null,"X",0,0,"-",2,null,2,0,0,"-",2,null,2,0,0,"-",1,null,2,0,0,"-",2,null,2,0,0,"-",2,null,2,0,1,"-",1,null,"X",0,1,"-",1,null,"X",0,2,"-",1,null,1,0,0,"-",2,null,2,0,0,"-",0,null,"X",0,2,"-",1,null,1,0,1,"-",2,null,2,0,1,"-",1,null,"X",0,1,"-",2,null,2,0,1,"-",1,null,"X",0,1,"-",1,null,"X",0,2,"-",1,null,1,0,2,"-",1,null,1,0,2,"-",1,null,1,0,0,"-",3,null,2,0,1,"-",3,null,2,0,2,"-",1,null,1,0,2,"-",0,null,1,0,2,"-",2,null,"X",0,1,"-",2,null,2,0,1,"-",1,null,"X",0,1,"-",0,null,1,0,1,"-",2,null,2,0,0,"-",1,null,2,0]
["2018-06-26","Kl 20.00","Island","-","Krotien"," ","-",null,null,0,2,"-",1,null,1,0,0,"-",1,null,2,0,0,"-",2,null,2,0,3,"-",1,null,1,0,1,"-",0,null,1,0,2,"-",0,null,1,0,1,"-",2,null,2,0,1,"-",3,null,2,0,1,"-",1,null,"X",0,3,"-",1,null,1,0,2,"-",2,null,"X",0,1,"-",2,null,2,0,1,"-",3,null,2,0,1,"-",0,null,1,0,2,"-",0,null,1,0,1,"-",3,null,2,0,0,"-",1,null,2,0,1,"-",1,null,"X",0,0,"-",2,null,2,0,1,"-",2,null,2,0,0,"-",1,null,2,0,1,"-",2,null,2,0,1,"-",3,null,2,0,0,"-",2,null,2,0,2,"-",1,null,1,0,1,"-",2,null,2,0,2,"-",2,null,"X",0,1,"-",0,null,1,0,1,"-",1,null,"X",0,1,"-",2,null,2,0,2,"-",2,null,"X",0,1,"-",1,null,"X",0,1,"-",2,null,2,0,2,"-",1,null,1,0,2,"-",1,null,1,0,0,"-",2,null,2,0,1,"-",1,null,"X",0,0,"-",1,null,2,0,0,"-",0,null,"X",0,0,"-",0,null,"X",0,1,"-",2,null,2,0,1,"-",2,null,2,0,1,"-",1,null,"X",0,1,"-",1,null,"X",0,1,"-",1,null,"X",0,1,"-",2,null,2,0,3,"-",2,null,1,0,2,"-",2,null,"X",0,1,"-",2,null,2,0,2,"-",1,null,1,0,1,"-",2,null,2,0,0,"-",1,null,2,0,0,"-",1,null,2,0,1,"-",1,null,"X",0,1,"-",2,null,2,0,3,"-",1,null,1,0]
["2018-06-26","Kl 20.00","Nigeria","-","Argentina"," ","-"," ",null,0,1,"-",2,null,2,0,1,"-",2,null,2,0,2,"-",1,null,1,0,0,"-",2,null,2,0,1,"-",0,null,1,0,0,"-",2,null,2,0,1,"-",3,null,2,0,2,"-",4,null,2,0,1,"-",3,null,2,0,2,"-",3,null,2,0,1,"-",1,null,"X",0,2,"-",4,null,2,0,0,"-",2,null,2,0,1,"-",2,null,2,0,1,"-",4,null,2,0,0,"-",2,null,2,0,1,"-",2,null,2,0,1,"-",2,null,2,0,1,"-",2,null,2,0,0,"-",2,null,2,0,0,"-",3,null,2,0,2,"-",3,null,2,0,4,"-",2,null,1,0,1,"-",2,null,2,0,1,"-",3,null,2,0,2,"-",1,null,1,0,1,"-",2,null,2,0,1,"-",1,null,"X",0,0,"-",2,null,2,0,0,"-",3,null,2,0,1,"-",4,null,2,0,0,"-",2,null,2,0,1,"-",2,null,2,0,1,"-",3,null,2,0,2,"-",2,null,"X",0,0,"-",3,null,2,0,1,"-",3,null,2,0,0,"-",4,null,2,0,2,"-",2,null,"X",0,0,"-",2,null,2,0,1,"-",3,null,2,0,1,"-",2,null,2,0,0,"-",2,null,2,0,0,"-",2,null,2,0,1,"-",1,null,"X",0,2,"-",3,null,2,0,6,"-",6,null,"X",0,2,"-",2,null,"X",0,1,"-",5,null,2,0,2,"-",4,null,2,0,0,"-",2,null,2,0,1,"-",3,null,2,0,1,"-",2,null,2,0,1,"-",1,null,"X",0,1,"-",3,null,2,0,1,"-",1,null,"X",0]
["2018-06-27","Kl 16.00","Mexiko","-","Sverige"," ","-"," ",null,0,0,"-",1,null,2,0,2,"-",2,null,"X",0,0,"-",1,null,2,0,1,"-",4,null,2,0,1,"-",0,null,1,0,1,"-",3,null,2,0,1,"-",1,null,"X",0,2,"-",2,null,"X",0,2,"-",0,null,1,0,3,"-",3,null,"X",0,1,"-",0,null,1,0,1,"-",3,null,2,0,1,"-",3,null,2,0,1,"-",2,null,2,0,2,"-",2,null,"X",0,1,"-",2,null,2,0,1,"-",1,null,"X",0,1,"-",1,null,"X",0,0,"-",2,null,2,0,1,"-",2,null,2,0,1,"-",2,null,2,0,1,"-",2,null,2,0,2,"-",3,null,2,0,1,"-",2,null,2,0,1,"-",2,null,2,0,1,"-",2,null,2,0,1,"-",1,null,"X",0,1,"-",2,null,2,0,1,"-",1,null,"X",0,1,"-",0,null,1,0,2,"-",2,null,"X",0,1,"-",2,null,2,0,2,"-",1,null,1,0,1,"-",1,null,"X",0,2,"-",3,null,2,0,1,"-",1,null,"X",0,1,"-",1,null,"X",0,0,"-",1,null,2,0,2,"-",0,null,1,0,1,"-",2,null,2,0,0,"-",2,null,2,0,1,"-",0,null,1,0,1,"-",3,null,2,0,0,"-",2,null,2,0,0,"-",3,null,2,0,1,"-",2,null,2,0,3,"-",0,null,1,0,0,"-",1,null,2,0,2,"-",2,null,"X",0,1,"-",2,null,2,0,1,"-",2,null,2,0,1,"-",0,null,1,0,1,"-",0,null,1,0,2,"-",0,null,1,0,1,"-",2,null,2,0,1,"-",3,null,2,0]
["2018-06-27","Kl 16.00","Sydkorea","-","Tyskland"," ","-"," ",null,0,0,"-",2,null,2,0,2,"-",1,null,1,0,0,"-",2,null,2,0,2,"-",3,null,2,0,2,"-",3,null,2,0,0,"-",2,null,2,0,0,"-",4,null,2,0,0,"-",5,null,2,0,1,"-",5,null,2,0,1,"-",4,null,2,0,0,"-",2,null,2,0,1,"-",3,null,2,0,1,"-",2,null,2,0,0,"-",2,null,2,0,0,"-",5,null,2,0,0,"-",4,null,2,0,1,"-",2,null,2,0,0,"-",2,null,2,0,0,"-",3,null,2,0,0,"-",3,null,2,0,0,"-",3,null,2,0,1,"-",3,null,2,0,1,"-",4,null,2,0,0,"-",4,null,2,0,0,"-",3,null,2,0,0,"-",4,null,2,0,0,"-",3,null,2,0,0,"-",2,null,2,0,0,"-",3,null,2,0,0,"-",3,null,2,0,1,"-",5,null,2,0,0,"-",2,null,2,0,0,"-",2,null,2,0,1,"-",3,null,2,0,2,"-",4,null,2,0,0,"-",2,null,2,0,1,"-",1,null,"X",0,0,"-",1,null,2,0,1,"-",0,null,1,0,1,"-",4,null,2,0,0,"-",2,null,2,0,0,"-",2,null,2,0,1,"-",3,null,2,0,1,"-",3,null,2,0,0,"-",4,null,2,0,1,"-",3,null,2,0,0,"-",3,null,2,0,1,"-",6,null,2,0,1,"-",1,null,"X",0,1,"-",3,null,2,0,0,"-",2,null,2,0,0,"-",1,null,2,0,0,"-",2,null,2,0,1,"-",3,null,2,0,0,"-",4,null,2,0,0,"-",3,null,2,0]
["2018-06-27","Kl 20.00","Serbien","-","Brasilien"," ","-"," ",null,0,1,"-",3,null,2,0,1,"-",0,null,1,0,0,"-",2,null,2,0,0,"-",2,null,2,0,1,"-",2,null,2,0,0,"-",2,null,2,0,1,"-",3,null,2,0,0,"-",2,null,2,0,1,"-",4,null,2,0,1,"-",2,null,2,0,0,"-",3,null,2,0,2,"-",3,null,2,0,1,"-",3,null,2,0,1,"-",3,null,2,0,0,"-",4,null,2,0,1,"-",3,null,2,0,1,"-",2,null,2,0,0,"-",2,null,2,0,1,"-",2,null,2,0,0,"-",2,null,2,0,1,"-",4,null,2,0,1,"-",2,null,2,0,1,"-",5,null,2,0,0,"-",3,null,2,0,1,"-",4,null,2,0,1,"-",1,null,"X",0,2,"-",3,null,2,0,1,"-",2,null,2,0,0,"-",2,null,2,0,0,"-",2,null,2,0,1,"-",2,null,2,0,1,"-",2,null,2,0,1,"-",2,null,2,0,1,"-",4,null,2,0,3,"-",2,null,1,0,0,"-",2,null,2,0,2,"-",3,null,2,0,0,"-",1,null,2,0,0,"-",0,null,"X",0,1,"-",2,null,2,0,1,"-",2,null,2,0,1,"-",2,null,2,0,0,"-",3,null,2,0,0,"-",3,null,2,0,2,"-",1,null,1,0,1,"-",2,null,2,0,2,"-",4,null,2,0,2,"-",5,null,2,0,1,"-",3,null,2,0,1,"-",2,null,2,0,0,"-",2,null,2,0,1,"-",2,null,2,0,0,"-",2,null,2,0,1,"-",3,null,2,0,1,"-",3,null,2,0,1,"-",2,null,2,0]
["2018-06-27","Kl 20.00","Schweiz","-","Costa Rica"," ","-"," ",null,0,2,"-",0,null,1,0,0,"-",0,null,"X",0,1,"-",1,null,"X",0,2,"-",0,null,1,0,1,"-",0,null,1,0,1,"-",2,null,2,0,2,"-",0,null,1,0,2,"-",0,null,1,0,0,"-",0,null,"X",0,1,"-",3,null,2,0,1,"-",0,null,1,0,1,"-",1,null,"X",0,1,"-",1,null,"X",0,1,"-",1,null,"X",0,1,"-",0,null,1,0,1,"-",1,null,"X",0,1,"-",2,null,2,0,2,"-",0,null,1,0,1,"-",1,null,"X",0,0,"-",1,null,2,0,0,"-",3,null,2,0,1,"-",1,null,"X",0,0,"-",2,null,2,0,1,"-",1,null,"X",0,2,"-",2,null,"X",0,1,"-",1,null,"X",0,2,"-",1,null,1,0,0,"-",0,null,"X",0,1,"-",1,null,"X",0,2,"-",0,null,1,0,2,"-",0,null,1,0,2,"-",0,null,1,0,1,"-",0,null,1,0,0,"-",0,null,"X",0,3,"-",1,null,1,0,1,"-",0,null,1,0,1,"-",1,null,"X",0,2,"-",1,null,1,0,1,"-",2,null,2,0,1,"-",0,null,1,0,1,"-",0,null,1,0,2,"-",0,null,1,0,2,"-",1,null,1,0,1,"-",1,null,"X",0,2,"-",1,null,1,0,1,"-",1,null,"X",0,2,"-",3,null,2,0,6,"-",6,null,"X",0,2,"-",0,null,1,0,3,"-",1,null,1,0,2,"-",0,null,1,0,0,"-",1,null,2,0,1,"-",0,null,1,0,1,"-",3,null,2,0,1,"-",2,null,2,0,2,"-",2,null,"X",0]
["2018-06-28","Kl 16.00","Japan","-","Polen"," ","-"," ",null,0,1,"-",1,null,"X",0,0,"-",2,null,2,0,0,"-",1,null,2,0,1,"-",2,null,2,0,2,"-",0,null,1,0,0,"-",2,null,2,0,0,"-",0,null,"X",0,1,"-",1,null,"X",0,1,"-",1,null,"X",0,2,"-",1,null,1,0,0,"-",0,null,"X",0,1,"-",1,null,"X",0,2,"-",1,null,1,0,0,"-",0,null,"X",0,2,"-",2,null,"X",0,1,"-",1,null,"X",0,1,"-",0,null,1,0,0,"-",2,null,2,0,0,"-",1,null,2,0,0,"-",1,null,2,0,1,"-",2,null,2,0,2,"-",1,null,1,0,1,"-",1,null,"X",0,0,"-",2,null,2,0,1,"-",1,null,"X",0,1,"-",2,null,2,0,0,"-",1,null,2,0,1,"-",0,null,1,0,1,"-",2,null,2,0,0,"-",2,null,2,0,1,"-",2,null,2,0,1,"-",2,null,2,0,1,"-",1,null,"X",0,1,"-",1,null,"X",0,2,"-",3,null,2,0,0,"-",2,null,2,0,2,"-",2,null,"X",0,0,"-",1,null,2,0,1,"-",0,null,1,0,2,"-",2,null,"X",0,0,"-",0,null,"X",0,1,"-",2,null,2,0,1,"-",1,null,"X",0,0,"-",1,null,2,0,3,"-",0,null,1,0,2,"-",1,null,1,0,6,"-",1,null,1,0,5,"-",3,null,1,0,2,"-",2,null,"X",0,1,"-",1,null,"X",0,1,"-",1,null,"X",0,0,"-",1,null,2,0,1,"-",1,null,"X",0,1,"-",3,null,2,0,0,"-",1,null,2,0,1,"-",1,null,"X",0]
["2018-06-28","Kl 16.00","Senegal","-","Colombia"," ","-"," ",null,0,2,"-",1,null,{"$f":"IF(K47=M47,\"X\",IF(K47>M47,1,2))","v":1},{"$f":"IF($F47=K47,IF($H47=M47,5,IF($J47=O47,3,0)),IF($J47=O47,3,0))","v":0},2,"-",1,null,{"$f":"IF(Q47=S47,\"X\",IF(Q47>S47,1,2))","v":1},{"$f":"IF($F47=Q47,IF($H47=S47,5,IF($J47=U47,3,0)),IF($J47=U47,3,0))","v":0},0,"-",1,null,{"$f":"IF(W47=Y47,\"X\",IF(W47>Y47,1,2))","v":2},{"$f":"IF($F47=W47,IF($H47=Y47,5,IF($J47=AA47,3,0)),IF($J47=AA47,3,0))","v":0},1,"-",2,null,{"$f":"IF(AC47=AE47,\"X\",IF(AC47>AE47,1,2))","v":2},{"$f":"IF($F47=AC47,IF($H47=AE47,5,IF($J47=AG47,3,0)),IF($J47=AG47,3,0))","v":0},1,"-",2,null,{"$f":"IF(AI47=AK47,\"X\",IF(AI47>AK47,1,2))","v":2},{"$f":"IF($F47=AI47,IF($H47=AK47,5,IF($J47=AM47,3,0)),IF($J47=AM47,3,0))","v":0},0,"-",3,null,{"$f":"IF(AO47=AQ47,\"X\",IF(AO47>AQ47,1,2))","v":2},{"$f":"IF($F47=AO47,IF($H47=AQ47,5,IF($J47=AS47,3,0)),IF($J47=AS47,3,0))","v":0},3,"-",0,null,{"$f":"IF(AU47=AW47,\"X\",IF(AU47>AW47,1,2))","v":1},{"$f":"IF($F47=AU47,IF($H47=AW47,5,IF($J47=AY47,3,0)),IF($J47=AY47,3,0))","v":0},3,"-",2,null,{"$f":"IF(BA47=BC47,\"X\",IF(BA47>BC47,1,2))","v":1},{"$f":"IF($F47=BA47,IF($H47=BC47,5,IF($J47=BE47,3,0)),IF($J47=BE47,3,0))","v":0},0,"-",2,null,{"$f":"IF(BG47=BI47,\"X\",IF(BG47>BI47,1,2))","v":2},{"$f":"IF($F47=BG47,IF($H47=BI47,5,IF($J47=BK47,3,0)),IF($J47=BK47,3,0))","v":0},3,"-",1,null,{"$f":"IF(BM47=BO47,\"X\",IF(BM47>BO47,1,2))","v":1},{"$f":"IF($F47=BM47,IF($H47=BO47,5,IF($J47=BQ47,3,0)),IF($J47=BQ47,3,0))","v":0},1,"-",1,null,{"$f":"IF(BS47=BU47,\"X\",IF(BS47>BU47,1,2))","v":"X"},{"$f":"IF($F47=BS47,IF($H47=BU47,5,IF($J47=BW47,3,0)),IF($J47=BW47,3,0))","v":0},1,"-",2,null,{"$f":"IF(BY47=CA47,\"X\",IF(BY47>CA47,1,2))","v":2},{"$f":"IF($F47=BY47,IF($H47=CA47,5,IF($J47=CC47,3,0)),IF($J47=CC47,3,0))","v":0},1,"-",0,null,{"$f":"IF(CE47=CG47,\"X\",IF(CE47>CG47,1,2))","v":1},{"$f":"IF($F47=CE47,IF($H47=CG47,5,IF($J47=CI47,3,0)),IF($J47=CI47,3,0))","v":0},1,"-",2,null,{"$f":"IF(CK47=CM47,\"X\",IF(CK47>CM47,1,2))","v":2},{"$f":"IF($F47=CK47,IF($H47=CM47,5,IF($J47=CO47,3,0)),IF($J47=CO47,3,0))","v":0},1,"-",1,null,{"$f":"IF(CQ47=CS47,\"X\",IF(CQ47>CS47,1,2))","v":"X"},{"$f":"IF($F47=CQ47,IF($H47=CS47,5,IF($J47=CU47,3,0)),IF($J47=CU47,3,0))","v":0},1,"-",2,null,{"$f":"IF(CW47=CY47,\"X\",IF(CW47>CY47,1,2))","v":2},{"$f":"IF($F47=CW47,IF($H47=CY47,5,IF($J47=DA47,3,0)),IF($J47=DA47,3,0))","v":0},1,"-",1,null,{"$f":"IF(DC47=DE47,\"X\",IF(DC47>DE47,1,2))","v":"X"},{"$f":"IF($F47=DC47,IF($H47=DE47,5,IF($J47=DG47,3,0)),IF($J47=DG47,3,0))","v":0},0,"-",1,null,{"$f":"IF(DI47=DK47,\"X\",IF(DI47>DK47,1,2))","v":2},0,0,"-",1,null,{"$f":"IF(DO47=DQ47,\"X\",IF(DO47>DQ47,1,2))","v":2},{"$f":"IF($F47=DO47,IF($H47=DQ47,5,IF($J47=DS47,3,0)),IF($J47=DS47,3,0))","v":0},1,"-",1,null,{"$f":"IF(DU47=DW47,\"X\",IF(DU47>DW47,1,2))","v":"X"},{"$f":"IF($F47=DU47,IF($H47=DW47,5,IF($J47=DY47,3,0)),IF($J47=DY47,3,0))","v":0},0,"-",2,null,{"$f":"IF(EA47=EC47,\"X\",IF(EA47>EC47,1,2))","v":2},{"$f":"IF($F47=EA47,IF($H47=EC47,5,IF($J47=EE47,3,0)),IF($J47=EE47,3,0))","v":0},3,"-",4,null,{"$f":"IF(EG47=EI47,\"X\",IF(EG47>EI47,1,2))","v":2},{"$f":"IF($F47=EG47,IF($H47=EI47,5,IF($J47=EK47,3,0)),IF($J47=EK47,3,0))","v":0},1,"-",2,null,{"$f":"IF(EM47=EO47,\"X\",IF(EM47>EO47,1,2))","v":2},{"$f":"IF($F47=EM47,IF($H47=EO47,5,IF($J47=EQ47,3,0)),IF($J47=EQ47,3,0))","v":0},1,"-",1,null,{"$f":"IF(ES47=EU47,\"X\",IF(ES47>EU47,1,2))","v":"X"},{"$f":"IF($F47=ES47,IF($H47=EU47,5,IF($J47=EW47,3,0)),IF($J47=EW47,3,0))","v":0},0,"-",3,null,{"$f":"IF(EY47=FA47,\"X\",IF(EY47>FA47,1,2))","v":2},{"$f":"IF($F47=EY47,IF($H47=FA47,5,IF($J47=FC47,3,0)),IF($J47=FC47,3,0))","v":0},2,"-",2,null,{"$f":"IF(FE47=FG47,\"X\",IF(FE47>FG47,1,2))","v":"X"},{"$f":"IF($F47=FE47,IF($H47=FG47,5,IF($J47=FI47,3,0)),IF($J47=FI47,3,0))","v":0},2,"-",1,null,{"$f":"IF(FK47=FM47,\"X\",IF(FK47>FM47,1,2))","v":1},{"$f":"IF($F47=FK47,IF($H47=FM47,5,IF($J47=FO47,3,0)),IF($J47=FO47,3,0))","v":0},2,"-",1,null,{"$f":"IF(FQ47=FS47,\"X\",IF(FQ47>FS47,1,2))","v":1},{"$f":"IF($F47=FQ47,IF($H47=FS47,5,IF($J47=FU47,3,0)),IF($J47=FU47,3,0))","v":0},1,"-",1,null,{"$f":"IF(FW47=FY47,\"X\",IF(FW47>FY47,1,2))","v":"X"},{"$f":"IF($F47=FW47,IF($H47=FY47,5,IF($J47=GA47,3,0)),IF($J47=GA47,3,0))","v":0},0,"-",1,null,{"$f":"IF(GC47=GE47,\"X\",IF(GC47>GE47,1,2))","v":2},{"$f":"IF($F47=GC47,IF($H47=GE47,5,IF($J47=GG47,3,0)),IF($J47=GG47,3,0))","v":0},0,"-",1,null,{"$f":"IF(GI47=GK47,\"X\",IF(GI47>GK47,1,2))","v":2},{"$f":"IF($F47=GI47,IF($H47=GK47,5,IF($J47=GM47,3,0)),IF($J47=GM47,3,0))","v":0},2,"-",0,null,{"$f":"IF(GO47=GQ47,\"X\",IF(GO47>GQ47,1,2))","v":1},{"$f":"IF($F47=GO47,IF($H47=GQ47,5,IF($J47=GS47,3,0)),IF($J47=GS47,3,0))","v":0},0,"-",1,null,{"$f":"IF(GU47=GW47,\"X\",IF(GU47>GW47,1,2))","v":2},{"$f":"IF($F47=GU47,IF($H47=GW47,5,IF($J47=GY47,3,0)),IF($J47=GY47,3,0))","v":0},1,"-",2,null,{"$f":"IF(HA47=HC47,\"X\",IF(HA47>HC47,1,2))","v":2},{"$f":"IF($F47=HA47,IF($H47=HC47,5,IF($J47=HE47,3,0)),IF($J47=HE47,3,0))","v":0},1,"-",3,null,{"$f":"IF(HG47=HI47,\"X\",IF(HG47>HI47,1,2))","v":2},{"$f":"IF($F47=HG47,IF($H47=HI47,5,IF($J47=HK47,3,0)),IF($J47=HK47,3,0))","v":0},1,"-",2,null,{"$f":"IF(HM47=HO47,\"X\",IF(HM47>HO47,1,2))","v":2},{"$f":"IF($F47=HM47,IF($H47=HO47,5,IF($J47=HQ47,3,0)),IF($J47=HQ47,3,0))","v":0},2,"-",0,null,{"$f":"IF(HS47=HU47,\"X\",IF(HS47>HU47,1,2))","v":1},{"$f":"IF($F47=HS47,IF($H47=HU47,5,IF($J47=HW47,3,0)),IF($J47=HW47,3,0))","v":0},3,"-",0,null,{"$f":"IF(HY47=IA47,\"X\",IF(HY47>IA47,1,2))","v":1},{"$f":"IF($F47=HY47,IF($H47=IA47,5,IF($J47=IC47,3,0)),IF($J47=IC47,3,0))","v":0},0,"-",3,null,{"$f":"IF(IE47=IG47,\"X\",IF(IE47>IG47,1,2))","v":2},{"$f":"IF($F47=IE47,IF($H47=IG47,5,IF($J47=II47,3,0)),IF($J47=II47,3,0))","v":0},1,"-",1,null,{"$f":"IF(IK47=IM47,\"X\",IF(IK47>IM47,1,2))","v":"X"},{"$f":"IF($F47=IK47,IF($H47=IM47,5,IF($J47=IO47,3,0)),IF($J47=IO47,3,0))","v":0},1,"-",4,null,{"$f":"IF(IQ47=IS47,\"X\",IF(IQ47>IS47,1,2))","v":2},{"$f":"IF($F47=IQ47,IF($H47=IS47,5,IF($J47=IU47,3,0)),IF($J47=IU47,3,0))","v":0},1,"-",1,null,{"$f":"IF(IW47=IY47,\"X\",IF(IW47>IY47,1,2))","v":"X"},{"$f":"IF($F47=IW47,IF($H47=IY47,5,IF($J47=JA47,3,0)),IF($J47=JA47,3,0))","v":0},0,"-",2,null,{"$f":"IF(JC47=JE47,\"X\",IF(JC47>JE47,1,2))","v":2},{"$f":"IF($F47=JC47,IF($H47=JE47,5,IF($J47=JG47,3,0)),IF($J47=JG47,3,0))","v":0},1,"-",2,null,{"$f":"IF(JI47=JK47,\"X\",IF(JI47>JK47,1,2))","v":2},{"$f":"IF($F47=JI47,IF($H47=JK47,5,IF($J47=JM47,3,0)),IF($J47=JM47,3,0))","v":0},0,"-",0,null,{"$f":"IF(JO47=JQ47,\"X\",IF(JO47>JQ47,1,2))","v":"X"},{"$f":"IF($F47=JO47,IF($H47=JQ47,5,IF($J47=JS47,3,0)),IF($J47=JS47,3,0))","v":0},3,"-",4,null,{"$f":"IF(JU47=JW47,\"X\",IF(JU47>JW47,1,2))","v":2},{"$f":"IF($F47=JU47,IF($H47=JW47,5,IF($J47=JY47,3,0)),IF($J47=JY47,3,0))","v":0},4,"-",4,null,{"$f":"IF(KA47=KC47,\"X\",IF(KA47>KC47,1,2))","v":"X"},{"$f":"IF($F47=KA47,IF($H47=KC47,5,IF($J47=KE47,3,0)),IF($J47=KE47,3,0))","v":0},3,"-",2,null,{"$f":"IF(KG47=KI47,\"X\",IF(KG47>KI47,1,2))","v":1},{"$f":"IF($F47=KG47,IF($H47=KI47,5,IF($J47=KK47,3,0)),IF($J47=KK47,3,0))","v":0},1,"-",1,null,{"$f":"IF(KM47=KO47,\"X\",IF(KM47>KO47,1,2))","v":"X"},{"$f":"IF($F47=KM47,IF($H47=KO47,5,IF($J47=KQ47,3,0)),IF($J47=KQ47,3,0))","v":0},2,"-",2,null,{"$f":"IF(KS47=KU47,\"X\",IF(KS47>KU47,1,2))","v":"X"},{"$f":"IF($F47=KS47,IF($H47=KU47,5,IF($J47=KW47,3,0)),IF($J47=KW47,3,0))","v":0},2,"-",2,null,{"$f":"IF(KY47=LA47,\"X\",IF(KY47>LA47,1,2))","v":"X"},{"$f":"IF($F47=KY47,IF($H47=LA47,5,IF($J47=LC47,3,0)),IF($J47=LC47,3,0))","v":0},0,"-",3,null,{"$f":"IF(LE47=LG47,\"X\",IF(LE47>LG47,1,2))","v":2},{"$f":"IF($F47=LE47,IF($H47=LG47,5,IF($J47=LI47,3,0)),IF($J47=LI47,3,0))","v":0},0,"-",2,null,{"$f":"IF(LK47=LM47,\"X\",IF(LK47>LM47,1,2))","v":2},{"$f":"IF($F47=LK47,IF($H47=LM47,5,IF($J47=LO47,3,0)),IF($J47=LO47,3,0))","v":0},2,"-",0,null,{"$f":"IF(LQ47=LS47,\"X\",IF(LQ47>LS47,1,2))","v":1},{"$f":"IF($F47=LQ47,IF($H47=LS47,5,IF($J47=LU47,3,0)),IF($J47=LU47,3,0))","v":0},1,"-",1,null,{"$f":"IF(LW47=LY47,\"X\",IF(LW47>LY47,1,2))","v":"X"},{"$f":"IF($F47=LW47,IF($H47=LY47,5,IF($J47=MA47,3,0)),IF($J47=MA47,3,0))","v":0},2,"-",1,null,{"$f":"IF(MC47=ME47,\"X\",IF(MC47>ME47,1,2))","v":1},{"$f":"IF($F47=MC47,IF($H47=ME47,5,IF($J47=MG47,3,0)),IF($J47=MG47,3,0))","v":0}]
["2018-06-28","Kl 20.00","Panama","-","Tunisien"," ","-",null,null,0,0,"-",1,null,2,0,1,"-",2,null,2,0,1,"-",1,null,"X",0,0,"-",2,null,2,0,0,"-",1,null,2,0,1,"-",1,null,"X",0,0,"-",1,null,2,0,0,"-",2,null,2,0,1,"-",1,null,"X",0,1,"-",1,null,"X",0,0,"-",2,null,2,0,0,"-",1,null,2,0,2,"-",1,null,1,0,0,"-",0,null,"X",0,0,"-",0,null,"X",0,1,"-",1,null,"X",0,2,"-",1,null,1,0,2,"-",2,null,"X",0,2,"-",2,null,"X",0,1,"-",1,null,"X",0,1,"-",1,null,"X",0,1,"-",3,null,2,0,2,"-",1,null,1,0,0,"-",2,null,2,0,2,"-",3,null,2,0,0,"-",3,null,2,0,1,"-",3,null,2,0,1,"-",1,null,"X",0,1,"-",2,null,2,0,1,"-",2,null,2,0,0,"-",2,null,2,0,1,"-",2,null,2,0,0,"-",0,null,"X",0,1,"-",0,null,1,0,2,"-",3,null,2,0,0,"-",2,null,2,0,2,"-",2,null,{"$f":"IF(HS48=HU48,\"X\",IF(HS48>HU48,1,2))","v":"X"},{"$f":"IF($F48=HS48,IF($H48=HU48,5,IF($J48=HW48,3,0)),IF($J48=HW48,3,0))","v":0},1,"-",1,null,{"$f":"IF(HY48=IA48,\"X\",IF(HY48>IA48,1,2))","v":"X"},{"$f":"IF($F48=HY48,IF($H48=IA48,5,IF($J48=IC48,3,0)),IF($J48=IC48,3,0))","v":0},1,"-",3,null,{"$f":"IF(IE48=IG48,\"X\",IF(IE48>IG48,1,2))","v":2},{"$f":"IF($F48=IE48,IF($H48=IG48,5,IF($J48=II48,3,0)),IF($J48=II48,3,0))","v":0},1,"-",2,null,{"$f":"IF(IK48=IM48,\"X\",IF(IK48>IM48,1,2))","v":2},{"$f":"IF($F48=IK48,IF($H48=IM48,5,IF($J48=IO48,3,0)),IF($J48=IO48,3,0))","v":0},1,"-",1,null,{"$f":"IF(IQ48=IS48,\"X\",IF(IQ48>IS48,1,2))","v":"X"},{"$f":"IF($F48=IQ48,IF($H48=IS48,5,IF($J48=IU48,3,0)),IF($J48=IU48,3,0))","v":0},1,"-",1,null,{"$f":"IF(IW48=IY48,\"X\",IF(IW48>IY48,1,2))","v":"X"},{"$f":"IF($F48=IW48,IF($H48=IY48,5,IF($J48=JA48,3,0)),IF($J48=JA48,3,0))","v":0},2,"-",2,null,{"$f":"IF(JC48=JE48,\"X\",IF(JC48>JE48,1,2))","v":"X"},{"$f":"IF($F48=JC48,IF($H48=JE48,5,IF($J48=JG48,3,0)),IF($J48=JG48,3,0))","v":0},1,"-",1,null,{"$f":"IF(JI48=JK48,\"X\",IF(JI48>JK48,1,2))","v":"X"},{"$f":"IF($F48=JI48,IF($H48=JK48,5,IF($J48=JM48,3,0)),IF($J48=JM48,3,0))","v":0},2,"-",1,null,{"$f":"IF(JO48=JQ48,\"X\",IF(JO48>JQ48,1,2))","v":1},{"$f":"IF($F48=JO48,IF($H48=JQ48,5,IF($J48=JS48,3,0)),IF($J48=JS48,3,0))","v":0},1,"-",3,null,{"$f":"IF(JU48=JW48,\"X\",IF(JU48>JW48,1,2))","v":2},{"$f":"IF($F48=JU48,IF($H48=JW48,5,IF($J48=JY48,3,0)),IF($J48=JY48,3,0))","v":0},0,"-",6,null,{"$f":"IF(KA48=KC48,\"X\",IF(KA48>KC48,1,2))","v":2},{"$f":"IF($F48=KA48,IF($H48=KC48,5,IF($J48=KE48,3,0)),IF($J48=KE48,3,0))","v":0},2,"-",5,null,{"$f":"IF(KG48=KI48,\"X\",IF(KG48>KI48,1,2))","v":2},{"$f":"IF($F48=KG48,IF($H48=KI48,5,IF($J48=KK48,3,0)),IF($J48=KK48,3,0))","v":0},2,"-",0,null,{"$f":"IF(KM48=KO48,\"X\",IF(KM48>KO48,1,2))","v":1},{"$f":"IF($F48=KM48,IF($H48=KO48,5,IF($J48=KQ48,3,0)),IF($J48=KQ48,3,0))","v":0},1,"-",0,null,{"$f":"IF(KS48=KU48,\"X\",IF(KS48>KU48,1,2))","v":1},{"$f":"IF($F48=KS48,IF($H48=KU48,5,IF($J48=KW48,3,0)),IF($J48=KW48,3,0))","v":0},0,"-",0,null,{"$f":"IF(KY48=LA48,\"X\",IF(KY48>LA48,1,2))","v":"X"},{"$f":"IF($F48=KY48,IF($H48=LA48,5,IF($J48=LC48,3,0)),IF($J48=LC48,3,0))","v":0},2,"-",1,null,{"$f":"IF(LE48=LG48,\"X\",IF(LE48>LG48,1,2))","v":1},{"$f":"IF($F48=LE48,IF($H48=LG48,5,IF($J48=LI48,3,0)),IF($J48=LI48,3,0))","v":0},0,"-",0,null,{"$f":"IF(LK48=LM48,\"X\",IF(LK48>LM48,1,2))","v":"X"},{"$f":"IF($F48=LK48,IF($H48=LM48,5,IF($J48=LO48,3,0)),IF($J48=LO48,3,0))","v":0},1,"-",0,null,{"$f":"IF(LQ48=LS48,\"X\",IF(LQ48>LS48,1,2))","v":1},{"$f":"IF($F48=LQ48,IF($H48=LS48,5,IF($J48=LU48,3,0)),IF($J48=LU48,3,0))","v":0},1,"-",1,null,{"$f":"IF(LW48=LY48,\"X\",IF(LW48>LY48,1,2))","v":"X"},{"$f":"IF($F48=LW48,IF($H48=LY48,5,IF($J48=MA48,3,0)),IF($J48=MA48,3,0))","v":0},3,"-",2,null,{"$f":"IF(MC48=ME48,\"X\",IF(MC48>ME48,1,2))","v":1},{"$f":"IF($F48=MC48,IF($H48=ME48,5,IF($J48=MG48,3,0)),IF($J48=MG48,3,0))","v":0}]
["2018-06-28","Kl 20.00","England",null,"Belgien"," ","-",null,null,0,1,"-",1,null,"X",{"$f":"IF($F49=K49,IF($H49=M49,5,IF($J49=O49,3,0)),IF($J49=O49,3,0))","v":0},2,"-",1,null,1,{"$f":"IF($F49=Q49,IF($H49=S49,5,IF($J49=U49,3,0)),IF($J49=U49,3,0))","v":0},0,"-",1,null,2,{"$f":"IF($F49=W49,IF($H49=Y49,5,IF($J49=AA49,3,0)),IF($J49=AA49,3,0))","v":0},3,"-",1,null,1,{"$f":"IF($F49=AC49,IF($H49=AE49,5,IF($J49=AG49,3,0)),IF($J49=AG49,3,0))","v":0},0,"-",1,null,2,{"$f":"IF($F49=AI49,IF($H49=AK49,5,IF($J49=AM49,3,0)),IF($J49=AM49,3,0))","v":0},3,"-",1,null,1,{"$f":"IF($F49=AO49,IF($H49=AQ49,5,IF($J49=AS49,3,0)),IF($J49=AS49,3,0))","v":0},0,"-",3,null,2,{"$f":"IF($F49=AU49,IF($H49=AW49,5,IF($J49=AY49,3,0)),IF($J49=AY49,3,0))","v":0},0,"-",2,null,2,{"$f":"IF($F49=BA49,IF($H49=BC49,5,IF($J49=BE49,3,0)),IF($J49=BE49,3,0))","v":0},1,"-",1,null,"X",{"$f":"IF($F49=BG49,IF($H49=BI49,5,IF($J49=BK49,3,0)),IF($J49=BK49,3,0))","v":0},3,"-",1,null,1,{"$f":"IF($F49=BM49,IF($H49=BO49,5,IF($J49=BQ49,3,0)),IF($J49=BQ49,3,0))","v":0},0,"-",0,null,"X",{"$f":"IF($F49=BS49,IF($H49=BU49,5,IF($J49=BW49,3,0)),IF($J49=BW49,3,0))","v":0},2,"-",1,null,1,{"$f":"IF($F49=BY49,IF($H49=CA49,5,IF($J49=CC49,3,0)),IF($J49=CC49,3,0))","v":0},2,"-",1,null,1,{"$f":"IF($F49=CE49,IF($H49=CG49,5,IF($J49=CI49,3,0)),IF($J49=CI49,3,0))","v":0},3,"-",1,null,1,{"$f":"IF($F49=CK49,IF($H49=CM49,5,IF($J49=CO49,3,0)),IF($J49=CO49,3,0))","v":0},4,"-",1,null,1,{"$f":"IF($F49=CQ49,IF($H49=CS49,5,IF($J49=CU49,3,0)),IF($J49=CU49,3,0))","v":0},2,"-",1,null,1,{"$f":"IF($F49=CW49,IF($H49=CY49,5,IF($J49=DA49,3,0)),IF($J49=DA49,3,0))","v":0},1,"-",1,null,"X",{"$f":"IF($F49=DC49,IF($H49=DE49,5,IF($J49=DG49,3,0)),IF($J49=DG49,3,0))","v":0},1,"-",1,null,"X",0,2,"-",3,null,2,{"$f":"IF($F49=DO49,IF($H49=DQ49,5,IF($J49=DS49,3,0)),IF($J49=DS49,3,0))","v":0},2,"-",2,null,"X",{"$f":"IF($F49=DU49,IF($H49=DW49,5,IF($J49=DY49,3,0)),IF($J49=DY49,3,0))","v":0},2,"-",1,null,1,{"$f":"IF($F49=EA49,IF($H49=EC49,5,IF($J49=EE49,3,0)),IF($J49=EE49,3,0))","v":0},1,"-",2,null,2,{"$f":"IF($F49=EG49,IF($H49=EI49,5,IF($J49=EK49,3,0)),IF($J49=EK49,3,0))","v":0},3,"-",1,null,1,{"$f":"IF($F49=EM49,IF($H49=EO49,5,IF($J49=EQ49,3,0)),IF($J49=EQ49,3,0))","v":0},1,"-",3,null,2,{"$f":"IF($F49=ES49,IF($H49=EU49,5,IF($J49=EW49,3,0)),IF($J49=EW49,3,0))","v":0},2,"-",2,null,"X",{"$f":"IF($F49=EY49,IF($H49=FA49,5,IF($J49=FC49,3,0)),IF($J49=FC49,3,0))","v":0},1,"-",1,null,"X",{"$f":"IF($F49=FE49,IF($H49=FG49,5,IF($J49=FI49,3,0)),IF($J49=FI49,3,0))","v":0},2,"-",1,null,1,{"$f":"IF($F49=FK49,IF($H49=FM49,5,IF($J49=FO49,3,0)),IF($J49=FO49,3,0))","v":0},1,"-",2,null,2,{"$f":"IF($F49=FQ49,IF($H49=FS49,5,IF($J49=FU49,3,0)),IF($J49=FU49,3,0))","v":0},1,"-",2,null,2,{"$f":"IF($F49=FW49,IF($H49=FY49,5,IF($J49=GA49,3,0)),IF($J49=GA49,3,0))","v":0},1,"-",2,null,2,{"$f":"IF($F49=GC49,IF($H49=GE49,5,IF($J49=GG49,3,0)),IF($J49=GG49,3,0))","v":0},1,"-",2,null,2,{"$f":"IF($F49=GI49,IF($H49=GK49,5,IF($J49=GM49,3,0)),IF($J49=GM49,3,0))","v":0},1,"-",1,null,"X",{"$f":"IF($F49=GO49,IF($H49=GQ49,5,IF($J49=GS49,3,0)),IF($J49=GS49,3,0))","v":0},1,"-",1,null,"X",{"$f":"IF($F49=GU49,IF($H49=GW49,5,IF($J49=GY49,3,0)),IF($J49=GY49,3,0))","v":0},1,"-",1,null,"X",{"$f":"IF($F49=HA49,IF($H49=HC49,5,IF($J49=HE49,3,0)),IF($J49=HE49,3,0))","v":0},4,"-",2,null,1,{"$f":"IF($F49=HG49,IF($H49=HI49,5,IF($J49=HK49,3,0)),IF($J49=HK49,3,0))","v":0},1,"-",1,null,"X",{"$f":"IF($F49=HM49,IF($H49=HO49,5,IF($J49=HQ49,3,0)),IF($J49=HQ49,3,0))","v":0},2,"-",1,null,1,{"$f":"IF($F49=HS49,IF($H49=HU49,5,IF($J49=HW49,3,0)),IF($J49=HW49,3,0))","v":0},3,"-",0,null,1,{"$f":"IF($F49=HY49,IF($H49=IA49,5,IF($J49=IC49,3,0)),IF($J49=IC49,3,0))","v":0},0,"-",2,null,2,{"$f":"IF($F49=IE49,IF($H49=IG49,5,IF($J49=II49,3,0)),IF($J49=II49,3,0))","v":0},1,"-",2,null,2,{"$f":"IF($F49=IK49,IF($H49=IM49,5,IF($J49=IO49,3,0)),IF($J49=IO49,3,0))","v":0},1,"-",0,null,1,{"$f":"IF($F49=IQ49,IF($H49=IS49,5,IF($J49=IU49,3,0)),IF($J49=IU49,3,0))","v":0},1,"-",1,null,"X",{"$f":"IF($F49=IW49,IF($H49=IY49,5,IF($J49=JA49,3,0)),IF($J49=JA49,3,0))","v":0},2,"-",1,null,1,{"$f":"IF($F49=JC49,IF($H49=JE49,5,IF($J49=JG49,3,0)),IF($J49=JG49,3,0))","v":0},1,"-",2,null,2,{"$f":"IF($F49=JI49,IF($H49=JK49,5,IF($J49=JM49,3,0)),IF($J49=JM49,3,0))","v":0},2,"-",0,null,1,{"$f":"IF($F49=JO49,IF($H49=JQ49,5,IF($J49=JS49,3,0)),IF($J49=JS49,3,0))","v":0},1,"-",2,null,2,{"$f":"IF($F49=JU49,IF($H49=JW49,5,IF($J49=JY49,3,0)),IF($J49=JY49,3,0))","v":0},2,"-",2,null,"X",{"$f":"IF($F49=KA49,IF($H49=KC49,5,IF($J49=KE49,3,0)),IF($J49=KE49,3,0))","v":0},3,"-",3,null,"X",{"$f":"IF($F49=KG49,IF($H49=KI49,5,IF($J49=KK49,3,0)),IF($J49=KK49,3,0))","v":0},2,"-",1,null,1,{"$f":"IF($F49=KM49,IF($H49=KO49,5,IF($J49=KQ49,3,0)),IF($J49=KQ49,3,0))","v":0},3,"-",2,null,1,{"$f":"IF($F49=KS49,IF($H49=KU49,5,IF($J49=KW49,3,0)),IF($J49=KW49,3,0))","v":0},0,"-",0,null,"X",{"$f":"IF($F49=KY49,IF($H49=LA49,5,IF($J49=LC49,3,0)),IF($J49=LC49,3,0))","v":0},1,"-",1,null,"X",{"$f":"IF($F49=LE49,IF($H49=LG49,5,IF($J49=LI49,3,0)),IF($J49=LI49,3,0))","v":0},1,"-",2,null,2,{"$f":"IF($F49=LK49,IF($H49=LM49,5,IF($J49=LO49,3,0)),IF($J49=LO49,3,0))","v":0},2,"-",0,null,1,{"$f":"IF($F49=LQ49,IF($H49=LS49,5,IF($J49=LU49,3,0)),IF($J49=LU49,3,0))","v":0},1,"-",2,null,2,{"$f":"IF($F49=LW49,IF($H49=LY49,5,IF($J49=MA49,3,0)),IF($J49=MA49,3,0))","v":0},3,"-",1,null,1,{"$f":"IF($F49=MC49,IF($H49=ME49,5,IF($J49=MG49,3,0)),IF($J49=MG49,3,0))","v":0}]
[null,null,null,null,null," ",null,null,null,null,"Argentina",null,null,null,1,{"$f":"IF($F50=K50,10,0)","v":0},"Tyskland",null,null,null,{"$f":"IF(Q50=S50,\"X\",IF(Q50>S50,1,2))","v":1},{"$f":"IF($F50=Q50,10,0)","v":0},"Tyskland",null,null,null,{"$f":"IF(W50=Y50,\"X\",IF(W50>Y50,1,2))","v":1},{"$f":"IF($F50=W50,10,0)","v":0},"Frankrike",null,null,null,1,{"$f":"IF($F50=AC50,10,0)","v":0},"Brasilien",null,null,null,1,{"$f":"IF($F50=AI50,10,0)","v":0},"Frankrike",null,null,null,1,{"$f":"IF($F50=AO50,10,0)","v":0},"Tyskland",null,null,null,1,{"$f":"IF($F50=AU50,10,0)","v":0},"Tyskland",null,null,null,1,{"$f":"IF($F50=BA50,10,0)","v":0},"Brasilien",null,null,null,1,{"$f":"IF($F50=BG50,10,0)","v":0},"Tyskland",null,null,null,1,{"$f":"IF($F50=BM50,10,0)","v":0},"Frankrike",null,null,null,1,{"$f":"IF($F50=BS50,10,0)","v":0},"Tyskland",null,null,null,1,{"$f":"IF($F50=BY50,10,0)","v":0},"Spanien",null,null,null,1,{"$f":"IF($F50=CE50,10,0)","v":0},"Tyskland",null,null,null,1,{"$f":"IF($F50=CK50,10,0)","v":0},"Argentina",null,null,null,1,{"$f":"IF($F50=CQ50,10,0)","v":0},"Spanien",null,null,null,1,{"$f":"IF($F50=CW50,10,0)","v":0},"Tyskland",null,null,null,1,{"$f":"IF($F50=DC50,10,0)","v":0},"Frankrike",null,null,null,1,{"$f":"IF($F50=DI50,10,0)","v":0},"England",null,null,null,1,{"$f":"IF($F50=DO50,10,0)","v":0},"Frankrike",null,null,null,1,{"$f":"IF($F50=DU50,10,0)","v":0},"Frankrike",null,null,null,1,{"$f":"IF($F50=EA50,10,0)","v":0},"Tyskland",null,null,null,1,{"$f":"IF($F50=EG50,10,0)","v":0},"Sverige",null,null,null,1,{"$f":"IF($F50=EM50,10,0)","v":0},"Tyskland",null,null,null,1,{"$f":"IF($F50=ES50,10,0)","v":0},"Tyskland",null,null,null,1,{"$f":"IF($F50=EY50,10,0)","v":0},"Belgien",null,null,null,1,{"$f":"IF($F50=FE50,10,0)","v":0},"Tyskland",null,null,null,1,{"$f":"IF($F50=FK50,10,0)","v":0},"Belgien",null,null,null,1,{"$f":"IF($F50=FQ50,10,0)","v":0},"Belgien",null,null,null,1,{"$f":"IF($F50=FW50,10,0)","v":0},"Tyskland",null,null,null,1,{"$f":"IF($F50=GC50,10,0)","v":0},"Tyskalnd",null,null,null,1,{"$f":"IF($F50=GI50,10,0)","v":0},"Tyskland",null,null,null,1,{"$f":"IF($F50=GO50,10,0)","v":0},"Brasilien",null,null,null,1,{"$f":"IF($F50=GU50,10,0)","v":0},"Frankrike",null,null,null,1,{"$f":"IF($F50=HA50,10,0)","v":0},"Tyskland",null,null,null,1,{"$f":"IF($F50=HG50,10,0)","v":0},"Argentina",null,null,null,1,{"$f":"IF($F50=HM50,10,0)","v":0},"Danmark",null,null,null,1,{"$f":"IF($F50=HS50,10,0)","v":0},"Tyskland",null,null,null,1,{"$f":"IF($F50=HY50,10,0)","v":0},"Argentina",null,null,null,1,{"$f":"IF($F50=IE50,10,0)","v":0},"Spanien",null,null,null,1,{"$f":"IF($F50=IK50,10,0)","v":0},"Spanien",null,null,null,1,{"$f":"IF($F50=IQ50,10,0)","v":0},"Argentina",null,null,null,1,{"$f":"IF($F50=IW50,10,0)","v":0},"Spanien",null,null,null,1,{"$f":"IF($F50=JC50,10,0)","v":0},"Tyskland",null,null,null,1,{"$f":"IF($F50=JI50,10,0)","v":0},"Tyskalnd",null,null,null,1,{"$f":"IF($F50=JO50,10,0)","v":0},"Frankrike",null,null,null,1,{"$f":"IF($F50=JU50,10,0)","v":0},"Mexico",null,null,null,1,{"$f":"IF($F50=KA50,10,0)","v":0},"Sverige",null,null,null,1,{"$f":"IF($F50=KG50,10,0)","v":0},"Sverige",null,null,null,1,{"$f":"IF($F50=KM50,10,0)","v":0},"Tyskland",null,null,null,1,{"$f":"IF($F50=KS50,10,0)","v":0},"Tyskland",null,null,null,1,{"$f":"IF($F50=KY50,10,0)","v":0},"Portugal",null,null,null,1,{"$f":"IF($F50=LE50,10,0)","v":0},"Brasilien",null,null,null,1,{"$f":"IF($F50=LK50,10,0)","v":0},"Brasilien",null,null,null,1,{"$f":"IF($F50=LQ50,10,0)","v":0},"Tyskland",null,null,null,1,{"$f":"IF($F50=LW50,10,0)","v":0},"Spanien",null,null,null,1,{"$f":"IF($F50=MC50,10,0)","v":0}]
[null,null,null,null,null,null,null,null,null,null,{"$f":"K1","v":"Christian"},null,null,null,null,{"$f":"SUM(P2:P50)","v":11},{"$f":"Q1","v":"Manfreed"},null,null,null,null,{"$f":"SUM(V2:V50)","v":3},{"$f":"W1","v":"Jessica"},null,null,null,null,{"$f":"SUM(AB2:AB50)","v":8},{"$f":"AC1","v":"Mia E"},null,null,null,null,{"$f":"SUM(AH2:AH50)","v":9},{"$f":"AI1","v":"Till minne av Esbjörn"},null,null,null,null,{"$f":"SUM(AN2:AN50)","v":8},{"$f":"AO1","v":"Lars L"},null,null,null,null,{"$f":"SUM(AT2:AT50)","v":11},{"$f":"AU1","v":"Roger W"},null,null,null,null,{"$f":"SUM(AZ2:AZ50)","v":6},{"$f":"BA1","v":"Roger W 2"},null,null,null,null,{"$f":"SUM(BF2:BF50)","v":6},{"$f":"BG1","v":"Tommy T 1"},null,null,null,null,{"$f":"SUM(BL2:BL50)","v":9},{"$f":"BM1","v":"Tommy T 2"},null,null,null,null,{"$f":"SUM(BR2:BR50)","v":14},{"$f":"BS1","v":"Tommy T 3"},null,null,null,null,{"$f":"SUM(BX2:BX50)","v":3},{"$f":"BY1","v":"Reino"},null,null,null,null,{"$f":"SUM(CD2:CD50)","v":9},{"$f":"CE1","v":"Lars Haglund"},null,null,null,null,{"$f":"SUM(CJ2:CJ50)","v":6},{"$f":"CK1","v":"Bo Fransson"},null,null,null,null,{"$f":"SUM(CP2:CP50)","v":3},{"$f":"CQ1","v":"Arne E"},null,null,null,null,{"$f":"SUM(CV2:CV50)","v":6},{"$f":"CW1","v":"Jonny E"},null,null,null,null,{"$f":"SUM(DB2:DB50)","v":9},{"$f":"DC1","v":"Jonte"},null,null,null,null,{"$f":"SUM(DH2:DH50)","v":6},{"$f":"DI1","v":"Mats-ola"},null,null,null,null,{"$f":"SUM(DN2:DN50)","v":11},{"$f":"DO1","v":"Mika"},null,null,null,null,{"$f":"SUM(DT2:DT50)","v":3},{"$f":"DU1","v":"Romee"},null,null,null,null,{"$f":"SUM(DZ2:DZ50)","v":9},{"$f":"EA1","v":"Anitha"},null,null,null,null,{"$f":"SUM(EF2:EF50)","v":12},{"$f":"EG1","v":"Ludde"},null,null,null,null,{"$f":"SUM(EL2:EL50)","v":11},{"$f":"EM1","v":"Jonas M"},null,null,null,null,{"$f":"SUM(ER2:ER50)","v":6},{"$f":"ES1","v":"Johan G"},null,null,null,null,{"$f":"SUM(EX2:EX50)","v":6},{"$f":"EY1","v":"Pernilla"},null,null,null,null,{"$f":"SUM(FD2:FD50)","v":14},{"$f":"FE1","v":"Christer 1"},null,null,null,null,{"$f":"SUM(FJ2:FJ50)","v":0},{"$f":"FK1","v":"Christer 2"},null,null,null,null,{"$f":"SUM(FP2:FP50)","v":9},{"$f":"FQ1","v":"Tina"},null,null,null,null,{"$f":"SUM(FV2:FV50)","v":9},{"$f":"FW1","v":"Monika A"},null,null,null,null,{"$f":"SUM(GB2:GB50)","v":9},{"$f":"GC1","v":"Edvin A"},null,null,null,null,{"$f":"SUM(GH2:GH50)","v":6},{"$f":"GI1","v":"Gustav"},null,null,null,null,{"$f":"SUM(GN2:GN50)","v":8},{"$f":"GO1","v":"Torvald"},null,null,null,null,{"$f":"SUM(GT2:GT50)","v":9},{"$f":"GU1","v":"Stefan L"},null,null,null,null,{"$f":"SUM(GZ2:GZ50)","v":9},{"$f":"HA1","v":"Dick W1"},null,null,null,null,{"$f":"SUM(HF2:HF50)","v":6},{"$f":"HG1","v":"Dick W2"},null,null,null,null,{"$f":"SUM(HL2:HL50)","v":6},{"$f":"HM1","v":"Bo Jansson"},null,null,null,null,{"$f":"SUM(HR2:HR50)","v":6},{"$f":"HS1","v":"Lennart C1"},null,null,null,null,{"$f":"SUM(HX2:HX50)","v":9},{"$f":"HY1","v":"Lennart C2"},null,null,null,null,{"$f":"SUM(ID2:ID50)","v":0},{"$f":"IE1","v":"Lennart C3"},null,null,null,null,{"$f":"SUM(IJ2:IJ50)","v":6},{"$f":"IK1","v":"Sonny "},null,null,null,null,{"$f":"SUM(IP2:IP50)","v":6},{"$f":"IQ1","v":"Jappe"},null,null,null,null,{"$f":"SUM(IV2:IV50)","v":3},{"$f":"IW1","v":"Hans Modh"},null,null,null,null,{"$f":"SUM(JB2:JB50)","v":11},{"$f":"JC1","v":"Monica Modh"},null,null,null,null,{"$f":"SUM(JH2:JH50)","v":6},{"$f":"JI1","v":"Gille"},null,null,null,null,{"$f":"SUM(JN2:JN50)","v":3},{"$f":"JO1","v":"Andreas"},null,null,null,null,{"$f":"SUM(JT2:JT50)","v":9},{"$f":"JU1","v":"Ludde 2"},null,null,null,null,{"$f":"SUM(JZ2:JZ50)","v":11},{"$f":"KA1","v":"Alf B"},null,null,null,null,{"$f":"SUM(KF2:KF50)","v":6},{"$f":"KG1","v":"Maria I"},null,null,null,null,{"$f":"SUM(KL2:KL50)","v":3},{"$f":"KM1","v":"Anne-Marie I"},null,null,null,null,{"$f":"SUM(KR2:KR50)","v":6},{"$f":"KS1","v":"Lars, Kjell, Rolf"},null,null,null,null,{"$f":"SUM(KX2:KX50)","v":6},{"$f":"KY1","v":"Jan E"},null,null,null,null,{"$f":"SUM(LD2:LD50)","v":8},{"$f":"LE1","v":"Rune Tjotta"},null,null,null,null,{"$f":"SUM(LJ2:LJ50)","v":9},{"$f":"LK1","v":"Wiking"},null,null,null,null,{"$f":"SUM(LP2:LP50)","v":8},{"$f":"LQ1","v":"Janne L"},null,null,null,null,{"$f":"SUM(LV2:LV50)","v":6},{"$f":"LW1","v":"Eva W"},null,null,null,null,{"$f":"SUM(MB2:MB50)","v":3},{"$f":"MC1","v":"Emma"},null,null,null,null,{"$f":"SUM(MH2:MH50)","v":8}]
[null,null,null,null,null,null,null,null,null,null,null,null,{"$f":"K51","v":"Christian"},{"$f":"L51","v":0},0,0,0,11,"Manfreed",0,0,0,0,3,"Jessica",0,0,0,0,8,"Mia E",0,0,0,0,9,"Till minne av Esbjörn",0,0,0,0,8,"Lars L",0,0,0,0,11,"Roger W",0,0,0,0,6,"Roger W 2",0,0,0,0,6,"Tommy T 1",0,0,0,0,9,"Tommy T 2",0,0,0,0,14,"Tommy T 3",0,0,0,0,{"$f":"BX51","v":3},"Reino",0,0,0,0,9,"Lars Haglund",0,0,0,0,6,"Bo Fransson",0,0,0,0,3,"Arne E",0,0,0,0,6,"Jonny E",0,0,0,0,9,"Jonte",0,0,0,0,6,"Mats-ola",0,0,3,0,11,"Mika",0,0,0,0,3,"Romee",0,0,0,0,9,"Anitha",0,0,0,0,12,"Ludde",0,0,{"$f":"EJ51","v":0},0,11,"Jonas M",0,0,0,0,6,"Johan G",0,0,0,0,6,"Pernilla",0,0,0,0,14,"Christer 1",0,0,0,0,0,"Christer 2",0,0,0,0,9,"Tina",0,0,0,0,9,"Monika A",0,0,0,0,9,"Edvin A",0,0,0,0,6,"Gustav",0,0,0,0,8,"Torvald",0,0,0,0,9,"Stefan L",{"$f":"GV51","v":0},0,0,0,9,"Dick W1",0,0,0,0,6,"Dick W2",0,0,0,0,6,"Bo Jansson",0,0,0,{"$f":"HQ51","v":0},{"$f":"HR51","v":6},{"$f":"HS51","v":"Lennart C1"},{"$f":"HT51","v":0},{"$f":"HU51","v":0},{"$f":"HV51","v":0},{"$f":"HW51","v":0},{"$f":"HX51","v":9},{"$f":"HY51","v":"Lennart C2"},{"$f":"HZ51","v":0},{"$f":"IA51","v":0},{"$f":"IB51","v":0},{"$f":"IC51","v":0},{"$f":"ID51","v":0},{"$f":"IE51","v":"Lennart C3"},{"$f":"IF51","v":0},{"$f":"IG51","v":0},{"$f":"IH51","v":0},{"$f":"II51","v":0},{"$f":"IJ51","v":6},{"$f":"IK51","v":"Sonny "},{"$f":"IL51","v":0},{"$f":"IM51","v":0},{"$f":"IN51","v":0},{"$f":"IO51","v":0},6,"Jappe",0,0,0,{"$f":"IU51","v":0},{"$f":"IV51","v":3},{"$f":"IW51","v":"Hans Modh"},{"$f":"IX51","v":0},{"$f":"IY51","v":0},{"$f":"IZ51","v":0},{"$f":"JA51","v":0},11,"Monica Modh",0,0,0,0,6,"Gille",0,0,0,0,3,"Andreas",0,0,0,0,9,"Ludde 2",0,0,0,0,11,"Alf B",0,0,0,0,6,"Maria I",0,0,0,0,3,"Anne-Marie I",0,0,0,0,6,"Lars, Kjell, Rolf",0,0,0,0,6,"Jan E",0,0,0,0,8,"Rune Tjotta",0,0,{"$f":"LH51","v":0},0,9,"Wiking",0,0,0,0,8,"Janne L",0,0,0,0,6,"Eva W",0,0,0,{"$f":"MA51","v":0},{"$f":"MB51","v":3},{"$f":"MC51","v":"Emma"},{"$f":"MD51","v":0},{"$f":"ME51","v":0},{"$f":"MF51","v":0}]
[{"$f":"INDEX($2:$50,MATCH(\" \",$F$2:$F$50,),A54)","v":"2018-06-16"},{"$f":"INDEX($2:$50,MATCH(\" \",$F$2:$F$50,),B54)","v":"Kl 12.00"},{"$f":"INDEX($C$2:$IV$50,MATCH(\" \",$F$2:$F$50,),C54)","v":"Frankrike"},"-",{"$f":"INDEX($C$2:$IV$50,MATCH(\" \",$F$2:$F$50,),E54)","v":"Australien"},{"$f":"INDEX($F$3:$ID$50,MATCH(\" \",$F$3:$F$50,),F54)","v":" "},{"$f":"INDEX($F$3:$ID$50,MATCH(\" \",$F$3:$F$50,),G54)","v":"-"},{"$f":"INDEX($F$3:$ID$50,MATCH(\" \",$F$3:$F$50,),H54)","v":" "},{"$f":"INDEX($F$3:$ID$50,MATCH(\" \",$F$3:$F$50,),I54)","v":0},{"$f":"INDEX($F$3:$ID$50,MATCH(\" \",$F$3:$F$50,),J54)","v":0},{"$f":"INDEX($F$2:$MB$50,MATCH(\" \",$F$2:$F$50,),K54)","v":1},{"$f":"INDEX($F$2:$IV$50,MATCH(\" \",$F$2:$F$50,),L54)","v":"-"},0,0,1,0,1,"-",0,0,1,0,2,"-",1,0,1,0,4,"-",1,0,1,0,1,"-",0,0,1,0,3,"-",1,0,1,0,3,"-",1,0,1,0,2,"-",0,0,1,0,3,"-",0,0,1,0,2,"-",1,0,1,0,2,"-",0,0,1,{"$f":"INDEX($F$2:$IV$50,MATCH(\" \",$F$2:$F$50,),BX54)","v":0},2,"-",1,0,1,0,2,"-",0,0,1,0,2,"-",0,0,1,0,4,"-",2,0,1,0,2,"-",0,0,1,0,2,"-",1,0,1,0,2,"-",1,0,1,0,3,"-",0,0,1,0,3,"-",1,0,1,0,2,"-",0,0,1,0,2,"-",1,{"$f":"INDEX($F$2:$IV$50,MATCH(\" \",$F$2:$F$50,),EJ54)","v":0},1,0,4,"-",1,0,1,0,4,"-",0,0,1,0,3,"-",1,0,1,0,3,"-",0,0,1,0,4,"-",0,0,1,0,2,"-",0,0,1,0,2,"-",0,0,1,0,2,"-",0,0,1,0,3,"-",0,0,1,0,2,"-",0,0,1,0,2,{"$f":"INDEX($F$2:$IV$50,MATCH(\" \",$F$2:$F$50,),GV54)","v":"-"},1,0,1,0,3,"-",0,0,1,0,2,"-",3,0,2,0,3,"-",0,0,1,0,2,"-",1,0,1,0,3,"-",0,0,1,0,1,"-",1,0,"X",0,2,"-",0,0,1,0,{"$f":"INDEX($F$2:$MB$50,MATCH(\" \",$F$2:$F$50,),IQ54)","v":1},"-",0,0,1,0,2,"-",0,0,1,0,2,"-",0,0,1,0,2,"-",0,0,1,0,4,"-",0,0,1,0,2,"-",{"$f":"INDEX($F$2:$MB$50,MATCH(\" \",$F$2:$F$50,),JW54)","v":1},0,1,0,4,"-",1,0,1,0,4,"-",3,0,1,0,3,"-",2,0,1,0,3,"-",{"$f":"INDEX($F$2:$MB$50,MATCH(\" \",$F$2:$F$50,),KU54)","v":1},{"$f":"INDEX($F$2:$MB$50,MATCH(\" \",$F$2:$F$50,),KV54)","v":0},1,0,2,"-",1,0,1,0,3,"-",0,0,1,0,2,"-",0,0,1,0,3,"-",0,0,1,0,2,"-",0,{"$f":"INDEX($F$2:$MB$50,MATCH(\" \",$F$2:$F$50,),LZ54)","v":0},1,0,{"$f":"INDEX($F$2:$MH$50,MATCH(\" \",$F$2:$F$50,),MC54)","v":1},{"$f":"INDEX($F$2:$MH$50,MATCH(\" \",$F$2:$F$50,),MD54)","v":"-"},0,0,1,0]
[null,null,null,null,null,null,null,null,null,null,6,{"$f":"K54+1","v":7},{"$f":"L54+1","v":8},9,10,11,12,13,14,15,16,17,18,19,20,21,22,23,24,25,26,27,28,29,30,31,32,33,34,35,36,37,38,39,40,41,42,43,44,45,46,47,48,49,50,51,52,53,54,55,56,57,58,59,60,61,62,63,64,65,66,67,68,69,70,71,{"$f":"BX54+1","v":72},73,74,75,76,77,78,79,80,81,82,83,84,85,86,87,88,89,90,91,92,93,94,95,96,97,98,99,100,101,102,103,104,105,106,107,108,109,110,111,112,113,114,115,116,117,118,119,120,121,122,123,124,125,126,127,128,129,130,131,132,133,134,135,{"$f":"EJ54+1","v":136},137,138,139,140,141,142,143,144,145,146,147,148,149,150,151,152,153,154,155,156,157,158,159,160,161,162,163,164,165,166,167,168,169,170,171,172,173,174,175,176,177,178,179,180,181,182,183,184,185,186,187,188,189,190,191,192,193,194,195,196,197,198,199,{"$f":"GV54+1","v":200},201,202,203,204,205,206,207,208,209,210,211,212,213,214,215,216,217,218,219,220,221,{"$f":"HR54+1","v":222},{"$f":"HS54+1","v":223},{"$f":"HT54+1","v":224},{"$f":"HU54+1","v":225},{"$f":"HV54+1","v":226},{"$f":"HW54+1","v":227},{"$f":"HX54+1","v":228},{"$f":"HY54+1","v":229},{"$f":"HZ54+1","v":230},{"$f":"IA54+1","v":231},{"$f":"IB54+1","v":232},{"$f":"IC54+1","v":233},{"$f":"ID54+1","v":234},{"$f":"IE54+1","v":235},{"$f":"IF54+1","v":236},{"$f":"IG54+1","v":237},{"$f":"IH54+1","v":238},{"$f":"II54+1","v":239},{"$f":"IJ54+1","v":240},{"$f":"IK54+1","v":241},{"$f":"IL54+1","v":242},{"$f":"IM54+1","v":243},{"$f":"IN54+1","v":244},{"$f":"IO54+1","v":245},246,247,248,249,{"$f":"IT54+1","v":250},251,252,253,254,255,256,257,258,259,260,261,262,263,264,265,266,267,268,269,270,271,272,273,274,275,276,277,278,279,280,281,{"$f":"JZ54+1","v":282},283,284,285,286,287,288,289,290,291,292,293,294,295,296,297,298,299,300,301,302,303,304,305,306,307,308,309,310,311,312,313,{"$f":"LF54+1","v":314},315,316,317,318,319,320,321,322,323,324,325,326,327,328,329,330,331,332,333,334,335,336,{"$f":"MC54+1","v":337},338,339,340,341]
[null,null,null,null,null,null,null,null,null,null,null,null,null,null,null,null,null,null,null,null,null,null,null,null,null,null,null,null,null,null,null,null,null,null,null,null,null,null,null,null,null,null,null,null,null,null,null,null,null,null,null,null,null,null,null,null,null,null,null,null,null,null,null,null,null,null,null,null,null,null,null,null,null,null,null,null,null,null,null,null,null,null,null,null,null,null,null,null,null,null,null,null,null,null,null,null,null,null,null,null,null,null,null,null,null,null,null,null,null,null,null,null,null,null,null,null,null,5]
[null,null,null,null,"Sydafrika",null,null,null,null,null,{"$f":"VLOOKUP(E56,C1:V49,9)","v":0},null,null,null,null,null,null,null,null,null,null,null,null,null,null,null,null,null,null,null,null,null,null,null,null,null,null,null,null,null,null,null,null,null,null,null,null,null,null,null,null,null,null,null,null,null,null,null,null,null,null,null,null,null,null,null,null,null,null,null,null,null,null,null,null,null,null,null,null,null,null,null,null,null,null,null,null,null,null,null,null,null,null,null,null,null,null,null,null,null,null,null,null,null,null,null,null,null,null,null,null,null,null,null,null,null,null,5]

{"sheet":"Blad1","index":1,"n_rows":0,"n_cols":0,"rows_kept":0,"cut":false,"hidden":false,"merged":[]}

{"sheet":"Poängställning","index":2,"n_rows":57,"n_cols":20,"rows_kept":57,"cut":false,"hidden":false,"merged":[]}
[null,null,null,null,null,null,null,null,null,null,null,null,null,"Nästa match på kupong"]
[1,"Tommy T 2",0,0,0,0,14,null,null,null,null,null,null,{"$f":"HLOOKUP($B2,Rader!$K$1:$MH$53,53,FALSE)","v":2},"-",{"$f":"HLOOKUP($B2,Rader!$M$52:$MH$53,2,FALSE)","v":1},null,{"$f":"Rader!A53","v":"2018-06-16"},null,{"$f":"Rader!B53","v":"Kl 12.00"}]
[{"$f":"A2+1","v":2},"Pernilla",0,0,0,0,14,null,null,null,null,null,null,{"$f":"HLOOKUP($B3,Rader!$K$1:$MH$53,53,FALSE)","v":3},"-",{"$f":"HLOOKUP($B3,Rader!$M$52:$MH$53,2,FALSE)","v":1},null,{"$f":"Rader!$C$53","v":"Frankrike"},"-",{"$f":"Rader!$E$53","v":"Australien"}]
[{"$f":"A3+1","v":3},"Anitha",0,0,0,0,12,null,null,null,null,null,null,{"$f":"HLOOKUP($B4,Rader!$K$1:$MH$53,53,FALSE)","v":2},"-",{"$f":"HLOOKUP($B4,Rader!$M$52:$MH$53,2,FALSE)","v":0}]
[4,"Christian",0,0,0,0,11,null,null,null,null,null,null,{"$f":"HLOOKUP($B5,Rader!$K$1:$MH$53,53,FALSE)","v":1},"-",{"$f":"HLOOKUP($B5,Rader!$M$52:$MH$53,2,FALSE)","v":0}]
[5,"Lars L",0,0,0,0,11,null,null,null,null,null,null,{"$f":"HLOOKUP($B6,Rader!$K$1:$MH$53,53,FALSE)","v":3},"-",{"$f":"HLOOKUP($B6,Rader!$M$52:$MH$53,2,FALSE)","v":1}]
[6,"Mats-ola",0,0,0,0,11,null,null,null,null,null,null,{"$f":"HLOOKUP($B7,Rader!$K$1:$MH$53,53,FALSE)","v":2},"-",{"$f":"HLOOKUP($B7,Rader!$M$52:$MH$53,2,FALSE)","v":1}]
[7,"Ludde",0,0,0,0,11,null,null,null,null,null,null,{"$f":"HLOOKUP($B8,Rader!$K$1:$MH$53,53,FALSE)","v":2},"-",{"$f":"HLOOKUP($B8,Rader!$M$52:$MH$53,2,FALSE)","v":1}]
[8,"Hans Modh",0,0,0,0,11,null,null,null,null,null,null,{"$f":"HLOOKUP($B9,Rader!$K$1:$MH$53,53,FALSE)","v":2},"-",{"$f":"HLOOKUP($B9,Rader!$M$52:$MH$53,2,FALSE)","v":0}]
[9,"Ludde 2",0,0,0,0,11,null,null,null,null,null,null,{"$f":"HLOOKUP($B10,Rader!$K$1:$MH$53,53,FALSE)","v":2},"-",{"$f":"HLOOKUP($B10,Rader!$M$52:$MH$53,2,FALSE)","v":1}]
[10,"Mia E",0,0,0,0,9,null,null,null,null,null,null,{"$f":"HLOOKUP($B11,Rader!$K$1:$MH$53,53,FALSE)","v":4},"-",{"$f":"HLOOKUP($B11,Rader!$M$52:$MH$53,2,FALSE)","v":1}]
[11,"Tommy T 1",0,0,0,0,9,null,null,null,null,null,null,{"$f":"HLOOKUP($B12,Rader!$K$1:$MH$53,53,FALSE)","v":3},"-",{"$f":"HLOOKUP($B12,Rader!$M$52:$MH$53,2,FALSE)","v":0}]
[12,"Reino",0,0,0,0,9,null,null,null,null,null,null,{"$f":"HLOOKUP($B13,Rader!$K$1:$MH$53,53,FALSE)","v":2},"-",{"$f":"HLOOKUP($B13,Rader!$M$52:$MH$53,2,FALSE)","v":1}]
[13,"Jonny E",0,0,0,0,9,null,null,null,null,null,null,{"$f":"HLOOKUP($B14,Rader!$K$1:$MH$53,53,FALSE)","v":2},"-",{"$f":"HLOOKUP($B14,Rader!$M$52:$MH$53,2,FALSE)","v":0}]
[14,"Romee",0,0,0,0,9,null,null,null,null,null,null,{"$f":"HLOOKUP($B15,Rader!$K$1:$MH$53,53,FALSE)","v":3},"-",{"$f":"HLOOKUP($B15,Rader!$M$52:$MH$53,2,FALSE)","v":1}]
[15,"Christer 2",0,0,0,0,9,null,null,null,null,null,null,{"$f":"HLOOKUP($B16,Rader!$K$1:$MH$53,53,FALSE)","v":4},"-",{"$f":"HLOOKUP($B16,Rader!$M$52:$MH$53,2,FALSE)","v":0}]
[16,"Tina",0,0,0,0,9,null,null,null,null,null,null,{"$f":"HLOOKUP($B17,Rader!$K$1:$MH$53,53,FALSE)","v":2},"-",{"$f":"HLOOKUP($B17,Rader!$M$52:$MH$53,2,FALSE)","v":0}]
[17,"Monika A",0,0,0,0,9,null,null,null,null,null,null,{"$f":"HLOOKUP($B18,Rader!$K$1:$MH$53,53,FALSE)","v":2},"-",{"$f":"HLOOKUP($B18,Rader!$M$52:$MH$53,2,FALSE)","v":0}]
[18,"Torvald",0,0,0,0,9,null,null,null,null,null,null,{"$f":"HLOOKUP($B19,Rader!$K$1:$MH$53,53,FALSE)","v":2},"-",{"$f":"HLOOKUP($B19,Rader!$M$52:$MH$53,2,FALSE)","v":0}]
[19,"Stefan L",0,0,0,0,9,null,null,null,null,null,null,{"$f":"HLOOKUP($B20,Rader!$K$1:$MH$53,53,FALSE)","v":2},"-",{"$f":"HLOOKUP($B20,Rader!$M$52:$MH$53,2,FALSE)","v":1}]
[20,"Lennart C1",0,0,0,0,9,null,null,null,null,null,null,{"$f":"HLOOKUP($B21,Rader!$K$1:$MH$53,53,FALSE)","v":2},"-",{"$f":"HLOOKUP($B21,Rader!$M$52:$MH$53,2,FALSE)","v":1}]
[21,"Andreas",0,0,0,0,9,null,null,null,null,null,null,{"$f":"HLOOKUP($B22,Rader!$K$1:$MH$53,53,FALSE)","v":4},"-",{"$f":"HLOOKUP($B22,Rader!$M$52:$MH$53,2,FALSE)","v":0}]
[22,"Rune Tjotta",0,0,0,0,9,null,null,null,null,null,null,{"$f":"HLOOKUP($B23,Rader!$K$1:$MH$53,53,FALSE)","v":3},"-",{"$f":"HLOOKUP($B23,Rader!$M$52:$MH$53,2,FALSE)","v":0}]
[23,"Jessica",0,0,0,0,8,null,null,null,null,null,null,{"$f":"HLOOKUP($B24,Rader!$K$1:$MH$53,53,FALSE)","v":2},"-",{"$f":"HLOOKUP($B24,Rader!$M$52:$MH$53,2,FALSE)","v":1}]
[24,"Till minne av Esbjörn",0,0,0,0,8,null,null,null,null,null,null,{"$f":"HLOOKUP($B25,Rader!$K$1:$MH$53,53,FALSE)","v":1},"-",{"$f":"HLOOKUP($B25,Rader!$M$52:$MH$53,2,FALSE)","v":0}]
[25,"Gustav",0,0,0,0,8,null,null,null,null,null,null,{"$f":"HLOOKUP($B26,Rader!$K$1:$MH$53,53,FALSE)","v":3},"-",{"$f":"HLOOKUP($B26,Rader!$M$52:$MH$53,2,FALSE)","v":0}]
[26,"Jan E",0,0,0,0,8,null,null,null,null,null,null,{"$f":"HLOOKUP($B27,Rader!$K$1:$MH$53,53,FALSE)","v":2},"-",{"$f":"HLOOKUP($B27,Rader!$M$52:$MH$53,2,FALSE)","v":1}]
[27,"Wiking",0,0,0,0,8,null,null,null,null,null,null,{"$f":"HLOOKUP($B28,Rader!$K$1:$MH$53,53,FALSE)","v":2},"-",{"$f":"HLOOKUP($B28,Rader!$M$52:$MH$53,2,FALSE)","v":0}]
[28,"Emma",0,0,0,0,8,null,null,null,null,null,null,{"$f":"HLOOKUP($B29,Rader!$K$1:$MH$53,53,FALSE)","v":1},"-",{"$f":"HLOOKUP($B29,Rader!$M$52:$MH$53,2,FALSE)","v":0}]
[29,"Roger W",0,0,0,0,6,null,null,null,null,null,null,{"$f":"HLOOKUP($B30,Rader!$K$1:$MH$53,53,FALSE)","v":3},"-",{"$f":"HLOOKUP($B30,Rader!$M$52:$MH$53,2,FALSE)","v":1}]
[30,"Roger W 2",0,0,0,0,6,null,null,null,null,null,null,{"$f":"HLOOKUP($B31,Rader!$K$1:$MH$53,53,FALSE)","v":2},"-",{"$f":"HLOOKUP($B31,Rader!$M$52:$MH$53,2,FALSE)","v":0}]
[31,"Lars Haglund",0,0,0,0,6,null,null,null,null,null,null,{"$f":"HLOOKUP($B32,Rader!$K$1:$MH$53,53,FALSE)","v":2},"-",{"$f":"HLOOKUP($B32,Rader!$M$52:$MH$53,2,FALSE)","v":0}]
[32,"Arne E",0,0,0,0,6,null,null,null,null,null,null,{"$f":"HLOOKUP($B33,Rader!$K$1:$MH$53,53,FALSE)","v":4},"-",{"$f":"HLOOKUP($B33,Rader!$M$52:$MH$53,2,FALSE)","v":2}]
[33,"Jonte",0,0,0,0,6,null,null,null,null,null,null,{"$f":"HLOOKUP($B34,Rader!$K$1:$MH$53,53,FALSE)","v":2},"-",{"$f":"HLOOKUP($B34,Rader!$M$52:$MH$53,2,FALSE)","v":1}]
[34,"Jonas M",0,0,0,0,6,null,null,null,null,null,null,{"$f":"HLOOKUP($B35,Rader!$K$1:$MH$53,53,FALSE)","v":4},"-",{"$f":"HLOOKUP($B35,Rader!$M$52:$MH$53,2,FALSE)","v":1}]
[35,"Johan G",0,0,0,0,6,null,null,null,null,null,null,{"$f":"HLOOKUP($B36,Rader!$K$1:$MH$53,53,FALSE)","v":4},"-",{"$f":"HLOOKUP($B36,Rader!$M$52:$MH$53,2,FALSE)","v":0}]
[36,"Edvin A",0,0,0,0,6,null,null,null,null,null,null,{"$f":"HLOOKUP($B37,Rader!$K$1:$MH$53,53,FALSE)","v":2},"-",{"$f":"HLOOKUP($B37,Rader!$M$52:$MH$53,2,FALSE)","v":0}]
[37,"Dick W1",0,0,0,0,6,null,null,null,null,null,null,{"$f":"HLOOKUP($B38,Rader!$K$1:$MH$53,53,FALSE)","v":3},"-",{"$f":"HLOOKUP($B38,Rader!$M$52:$MH$53,2,FALSE)","v":0}]
[38,"Dick W2",0,0,0,0,6,null,null,null,null,null,null,{"$f":"HLOOKUP($B39,Rader!$K$1:$MH$53,53,FALSE)","v":2},"-",{"$f":"HLOOKUP($B39,Rader!$M$52:$MH$53,2,FALSE)","v":3}]
[39,"Bo Jansson",0,0,0,0,6,null,null,null,null,null,null,{"$f":"HLOOKUP($B40,Rader!$K$1:$MH$53,53,FALSE)","v":3},"-",{"$f":"HLOOKUP($B40,Rader!$M$52:$MH$53,2,FALSE)","v":0}]
[40,"Lennart C3",0,0,0,0,6,null,null,null,null,null,null,{"$f":"HLOOKUP($B41,Rader!$K$1:$MH$53,53,FALSE)","v":1},"-",{"$f":"HLOOKUP($B41,Rader!$M$52:$MH$53,2,FALSE)","v":1}]
[41,"Sonny ",0,0,0,0,6,null,null,null,null,null,null,{"$f":"HLOOKUP($B42,Rader!$K$1:$MH$53,53,FALSE)","v":2},"-",{"$f":"HLOOKUP($B42,Rader!$M$52:$MH$53,2,FALSE)","v":0}]
[42,"Monica Modh",0,0,0,0,6,null,null,null,null,null,null,{"$f":"HLOOKUP($B43,Rader!$K$1:$MH$53,53,FALSE)","v":2},"-",{"$f":"HLOOKUP($B43,Rader!$M$52:$MH$53,2,FALSE)","v":0}]
[43,"Alf B",0,0,0,0,6,null,null,null,null,null,null,{"$f":"HLOOKUP($B44,Rader!$K$1:$MH$53,53,FALSE)","v":4},"-",{"$f":"HLOOKUP($B44,Rader!$M$52:$MH$53,2,FALSE)","v":1}]
[44,"Anne-Marie I",0,0,0,0,6,null,null,null,null,null,null,{"$f":"HLOOKUP($B45,Rader!$K$1:$MH$53,53,FALSE)","v":3},"-",{"$f":"HLOOKUP($B45,Rader!$M$52:$MH$53,2,FALSE)","v":2}]
[45,"Lars, Kjell, Rolf",0,0,0,0,6,null,null,null,null,null,null,{"$f":"HLOOKUP($B46,Rader!$K$1:$MH$53,53,FALSE)","v":3},"-",{"$f":"HLOOKUP($B46,Rader!$M$52:$MH$53,2,FALSE)","v":1}]
[46,"Janne L",0,0,0,0,6,null,null,null,null,null,null,{"$f":"HLOOKUP($B47,Rader!$K$1:$MH$53,53,FALSE)","v":3},"-",{"$f":"HLOOKUP($B47,Rader!$M$52:$MH$53,2,FALSE)","v":0}]
[47,"Manfreed",0,0,0,0,3,null,null,null,null,null,null,{"$f":"HLOOKUP($B48,Rader!$K$1:$MH$53,53,FALSE)","v":1},"-",{"$f":"HLOOKUP($B48,Rader!$M$52:$MH$53,2,FALSE)","v":0}]
[48,"Tommy T 3",0,0,0,0,3,null,null,null,null,null,null,{"$f":"HLOOKUP($B49,Rader!$K$1:$MH$53,53,FALSE)","v":2},"-",{"$f":"HLOOKUP($B49,Rader!$M$52:$MH$53,2,FALSE)","v":0}]
[49,"Bo Fransson",0,0,0,0,3,null,null,null,null,null,null,{"$f":"HLOOKUP($B50,Rader!$K$1:$MH$53,53,FALSE)","v":2},"-",{"$f":"HLOOKUP($B50,Rader!$M$52:$MH$53,2,FALSE)","v":0}]
[50,"Mika",0,0,0,0,3,null,null,null,null,null,null,{"$f":"HLOOKUP($B51,Rader!$K$1:$MH$53,53,FALSE)","v":3},"-",{"$f":"HLOOKUP($B51,Rader!$M$52:$MH$53,2,FALSE)","v":0}]
[51,"Jappe",0,0,0,0,3,null,null,null,null,null,null,{"$f":"HLOOKUP($B52,Rader!$K$1:$MH$53,53,FALSE)","v":1},"-",{"$f":"HLOOKUP($B52,Rader!$M$52:$MH$53,2,FALSE)","v":0}]
[52,"Gille",0,0,0,0,3,null,null,null,null,null,null,{"$f":"HLOOKUP($B53,Rader!$K$1:$MH$53,53,FALSE)","v":2},"-",{"$f":"HLOOKUP($B53,Rader!$M$52:$MH$53,2,FALSE)","v":0}]
[53,"Maria I",0,0,0,0,3,null,null,null,null,null,null,{"$f":"HLOOKUP($B54,Rader!$K$1:$MH$53,53,FALSE)","v":4},"-",{"$f":"HLOOKUP($B54,Rader!$M$52:$MH$53,2,FALSE)","v":3}]
[54,"Eva W",0,0,0,0,3,null,null,null,null,null,null,{"$f":"HLOOKUP($B55,Rader!$K$1:$MH$53,53,FALSE)","v":2},"-",{"$f":"HLOOKUP($B55,Rader!$M$52:$MH$53,2,FALSE)","v":0}]
[55,"Christer 1",0,0,0,0,0,null,null,null,null,null,null,{"$f":"HLOOKUP($B56,Rader!$K$1:$MH$53,53,FALSE)","v":3},"-",{"$f":"HLOOKUP($B56,Rader!$M$52:$MH$53,2,FALSE)","v":0}]
[56,"Lennart C2",0,0,0,0,0,null,null,null,null,null,null,{"$f":"HLOOKUP($B57,Rader!$K$1:$MH$53,53,FALSE)","v":3},"-",{"$f":"HLOOKUP($B57,Rader!$M$52:$MH$53,2,FALSE)","v":0}]

{"sheet":"Blad2","index":3,"n_rows":57,"n_cols":7,"rows_kept":57,"cut":false,"hidden":false,"merged":[]}
[]
[null,{"$f":"Rader!K51","v":"Christian"},{"$f":"Rader!L51","v":0},{"$f":"Rader!M51","v":0},{"$f":"Rader!N51","v":0},{"$f":"Rader!O51","v":0},{"$f":"Rader!P51","v":11}]
[null,{"$f":"Rader!Q51","v":"Manfreed"},{"$f":"Rader!R51","v":0},{"$f":"Rader!S51","v":0},{"$f":"Rader!T51","v":0},{"$f":"Rader!U51","v":0},{"$f":"Rader!V51","v":3}]
[null,{"$f":"Rader!W51","v":"Jessica"},{"$f":"Rader!X51","v":0},{"$f":"Rader!Y51","v":0},{"$f":"Rader!Z51","v":0},{"$f":"Rader!AA51","v":0},{"$f":"Rader!AB51","v":8}]
[null,{"$f":"Rader!AC51","v":"Mia E"},{"$f":"Rader!AD51","v":0},{"$f":"Rader!AE51","v":0},{"$f":"Rader!AF51","v":0},{"$f":"Rader!AG51","v":0},{"$f":"Rader!AH51","v":9}]
[null,{"$f":"Rader!AI51","v":"Till minne av Esbjörn"},{"$f":"Rader!AJ51","v":0},{"$f":"Rader!AK51","v":0},{"$f":"Rader!AL51","v":0},{"$f":"Rader!AM51","v":0},{"$f":"Rader!AN51","v":8}]
[null,{"$f":"Rader!AO51","v":"Lars L"},{"$f":"Rader!AP51","v":0},{"$f":"Rader!AQ51","v":0},{"$f":"Rader!AR51","v":0},{"$f":"Rader!AS51","v":0},{"$f":"Rader!AT51","v":11}]
[null,{"$f":"Rader!AU51","v":"Roger W"},{"$f":"Rader!AV51","v":0},{"$f":"Rader!AW51","v":0},{"$f":"Rader!AX51","v":0},{"$f":"Rader!AY51","v":0},{"$f":"Rader!AZ51","v":6}]
[null,{"$f":"Rader!BA51","v":"Roger W 2"},{"$f":"Rader!BB51","v":0},{"$f":"Rader!BC51","v":0},{"$f":"Rader!BD51","v":0},{"$f":"Rader!BE51","v":0},{"$f":"Rader!BF51","v":6}]
[null,{"$f":"Rader!BG51","v":"Tommy T 1"},{"$f":"Rader!BH51","v":0},{"$f":"Rader!BI51","v":0},{"$f":"Rader!BJ51","v":0},{"$f":"Rader!BK51","v":0},{"$f":"Rader!BL51","v":9}]
[null,{"$f":"Rader!BM51","v":"Tommy T 2"},{"$f":"Rader!BN51","v":0},{"$f":"Rader!BO51","v":0},{"$f":"Rader!BP51","v":0},{"$f":"Rader!BQ51","v":0},{"$f":"Rader!BR51","v":14}]
[null,{"$f":"Rader!BS51","v":"Tommy T 3"},{"$f":"Rader!BT51","v":0},{"$f":"Rader!BU51","v":0},{"$f":"Rader!BV51","v":0},{"$f":"Rader!BW51","v":0},{"$f":"Rader!BX51","v":3}]
[null,{"$f":"Rader!BY51","v":"Reino"},{"$f":"Rader!BZ51","v":0},{"$f":"Rader!CA51","v":0},{"$f":"Rader!CB51","v":0},{"$f":"Rader!CC51","v":0},{"$f":"Rader!CD51","v":9}]
[null,{"$f":"Rader!CE51","v":"Lars Haglund"},{"$f":"Rader!CF51","v":0},{"$f":"Rader!CG51","v":0},{"$f":"Rader!CH51","v":0},{"$f":"Rader!CI51","v":0},{"$f":"Rader!CJ51","v":6}]
[null,{"$f":"Rader!CK51","v":"Bo Fransson"},{"$f":"Rader!CL51","v":0},{"$f":"Rader!CM51","v":0},{"$f":"Rader!CN51","v":0},{"$f":"Rader!CO51","v":0},{"$f":"Rader!CP51","v":3}]
[null,{"$f":"Rader!CQ51","v":"Arne E"},{"$f":"Rader!CR51","v":0},{"$f":"Rader!CS51","v":0},{"$f":"Rader!CT51","v":0},{"$f":"Rader!CU51","v":0},{"$f":"Rader!CV51","v":6}]
[null,{"$f":"Rader!CW51","v":"Jonny E"},{"$f":"Rader!CX51","v":0},{"$f":"Rader!CY51","v":0},{"$f":"Rader!CZ51","v":0},{"$f":"Rader!DA51","v":0},{"$f":"Rader!DB51","v":9}]
[null,{"$f":"Rader!DC51","v":"Jonte"},{"$f":"Rader!DD51","v":0},{"$f":"Rader!DE51","v":0},{"$f":"Rader!DF51","v":0},{"$f":"Rader!DG51","v":0},{"$f":"Rader!DH51","v":6}]
[null,{"$f":"Rader!DI51","v":"Mats-ola"},{"$f":"Rader!DJ51","v":0},{"$f":"Rader!DK51","v":0},{"$f":"Rader!DL51","v":0},{"$f":"Rader!DM51","v":0},{"$f":"Rader!DN51","v":11}]
[null,{"$f":"Rader!DO51","v":"Mika"},{"$f":"Rader!DP51","v":0},{"$f":"Rader!DQ51","v":0},{"$f":"Rader!DR51","v":0},{"$f":"Rader!DS51","v":0},{"$f":"Rader!DT51","v":3}]
[null,{"$f":"Rader!DU51","v":"Romee"},{"$f":"Rader!DV51","v":0},{"$f":"Rader!DW51","v":0},{"$f":"Rader!DX51","v":0},{"$f":"Rader!DY51","v":0},{"$f":"Rader!DZ51","v":9}]
[null,{"$f":"Rader!EA51","v":"Anitha"},{"$f":"Rader!EB51","v":0},{"$f":"Rader!EC51","v":0},{"$f":"Rader!ED51","v":0},{"$f":"Rader!EE51","v":0},{"$f":"Rader!EF51","v":12}]
[null,{"$f":"Rader!EG51","v":"Ludde"},{"$f":"Rader!EH51","v":0},{"$f":"Rader!EI51","v":0},{"$f":"Rader!EJ51","v":0},{"$f":"Rader!EK51","v":0},{"$f":"Rader!EL51","v":11}]
[null,{"$f":"Rader!EM51","v":"Jonas M"},{"$f":"Rader!EN51","v":0},{"$f":"Rader!EO51","v":0},{"$f":"Rader!EP51","v":0},{"$f":"Rader!EQ51","v":0},{"$f":"Rader!ER51","v":6}]
[null,{"$f":"Rader!ES51","v":"Johan G"},{"$f":"Rader!ET51","v":0},{"$f":"Rader!EU51","v":0},{"$f":"Rader!EV51","v":0},{"$f":"Rader!EW51","v":0},{"$f":"Rader!EX51","v":6}]
[null,{"$f":"Rader!EY51","v":"Pernilla"},{"$f":"Rader!EZ51","v":0},{"$f":"Rader!FA51","v":0},{"$f":"Rader!FB51","v":0},{"$f":"Rader!FC51","v":0},{"$f":"Rader!FD51","v":14}]
[null,{"$f":"Rader!FE51","v":"Christer 1"},{"$f":"Rader!FF51","v":0},{"$f":"Rader!FG51","v":0},{"$f":"Rader!FH51","v":0},{"$f":"Rader!FI51","v":0},{"$f":"Rader!FJ51","v":0}]
[null,{"$f":"Rader!FK51","v":"Christer 2"},{"$f":"Rader!FL51","v":0},{"$f":"Rader!FM51","v":0},{"$f":"Rader!FN51","v":0},{"$f":"Rader!FO51","v":0},{"$f":"Rader!FP51","v":9}]
[null,{"$f":"Rader!FQ51","v":"Tina"},{"$f":"Rader!FR51","v":0},{"$f":"Rader!FS51","v":0},{"$f":"Rader!FT51","v":0},{"$f":"Rader!FU51","v":0},{"$f":"Rader!FV51","v":9}]
[null,{"$f":"Rader!FW51","v":"Monika A"},{"$f":"Rader!FX51","v":0},{"$f":"Rader!FY51","v":0},{"$f":"Rader!FZ51","v":0},{"$f":"Rader!GA51","v":0},{"$f":"Rader!GB51","v":9}]
[null,{"$f":"Rader!GC51","v":"Edvin A"},{"$f":"Rader!GD51","v":0},{"$f":"Rader!GE51","v":0},{"$f":"Rader!GF51","v":0},{"$f":"Rader!GG51","v":0},{"$f":"Rader!GH51","v":6}]
[null,{"$f":"Rader!GI51","v":"Gustav"},{"$f":"Rader!GJ51","v":0},{"$f":"Rader!GK51","v":0},{"$f":"Rader!GL51","v":0},{"$f":"Rader!GM51","v":0},{"$f":"Rader!GN51","v":8}]
[null,{"$f":"Rader!GO51","v":"Torvald"},{"$f":"Rader!GP51","v":0},{"$f":"Rader!GQ51","v":0},{"$f":"Rader!GR51","v":0},{"$f":"Rader!GS51","v":0},{"$f":"Rader!GT51","v":9}]
[null,{"$f":"Rader!GU51","v":"Stefan L"},{"$f":"Rader!GV51","v":0},{"$f":"Rader!GW51","v":0},{"$f":"Rader!GX51","v":0},{"$f":"Rader!GY51","v":0},{"$f":"Rader!GZ51","v":9}]
[null,{"$f":"Rader!HA51","v":"Dick W1"},{"$f":"Rader!HB51","v":0},{"$f":"Rader!HC51","v":0},{"$f":"Rader!HD51","v":0},{"$f":"Rader!HE51","v":0},{"$f":"Rader!HF51","v":6}]
[null,{"$f":"Rader!HG51","v":"Dick W2"},{"$f":"Rader!HH51","v":0},{"$f":"Rader!HI51","v":0},{"$f":"Rader!HJ51","v":0},{"$f":"Rader!HK51","v":0},{"$f":"Rader!HL51","v":6}]
[null,{"$f":"Rader!HM51","v":"Bo Jansson"},{"$f":"Rader!HN51","v":0},{"$f":"Rader!HO51","v":0},{"$f":"Rader!HP51","v":0},{"$f":"Rader!HQ51","v":0},{"$f":"Rader!HR51","v":6}]
[null,{"$f":"Rader!HS51","v":"Lennart C1"},{"$f":"Rader!HT51","v":0},{"$f":"Rader!HU51","v":0},{"$f":"Rader!HV51","v":0},{"$f":"Rader!HW51","v":0},{"$f":"Rader!HX51","v":9}]
[null,{"$f":"Rader!HY51","v":"Lennart C2"},{"$f":"Rader!HZ51","v":0},{"$f":"Rader!IA51","v":0},{"$f":"Rader!IB51","v":0},{"$f":"Rader!IC51","v":0},{"$f":"Rader!ID51","v":0}]
[null,{"$f":"Rader!IE51","v":"Lennart C3"},{"$f":"Rader!IF51","v":0},{"$f":"Rader!IG51","v":0},{"$f":"Rader!IH51","v":0},{"$f":"Rader!II51","v":0},{"$f":"Rader!IJ51","v":6}]
[null,{"$f":"Rader!IK51","v":"Sonny "},{"$f":"Rader!IL51","v":0},{"$f":"Rader!IM51","v":0},{"$f":"Rader!IN51","v":0},{"$f":"Rader!IO51","v":0},{"$f":"Rader!IP51","v":6}]
[null,{"$f":"Rader!IQ51","v":"Jappe"},{"$f":"Rader!IR51","v":0},{"$f":"Rader!IS51","v":0},{"$f":"Rader!IT51","v":0},{"$f":"Rader!IU51","v":0},{"$f":"Rader!IV51","v":3}]
[null,{"$f":"Rader!IW51","v":"Hans Modh"},{"$f":"Rader!IX51","v":0},{"$f":"Rader!IY51","v":0},{"$f":"Rader!IZ51","v":0},{"$f":"Rader!JA51","v":0},{"$f":"Rader!JB51","v":11}]
[null,{"$f":"Rader!JC51","v":"Monica Modh"},{"$f":"Rader!JD51","v":0},{"$f":"Rader!JE51","v":0},{"$f":"Rader!JF51","v":0},{"$f":"Rader!JG51","v":0},{"$f":"Rader!JH51","v":6}]
[null,{"$f":"Rader!JI51","v":"Gille"},{"$f":"Rader!JJ51","v":0},{"$f":"Rader!JK51","v":0},{"$f":"Rader!JL51","v":0},{"$f":"Rader!JM51","v":0},{"$f":"Rader!JN51","v":3}]
[null,{"$f":"Rader!JO51","v":"Andreas"},{"$f":"Rader!JP51","v":0},{"$f":"Rader!JQ51","v":0},{"$f":"Rader!JR51","v":0},{"$f":"Rader!JS51","v":0},{"$f":"Rader!JT51","v":9}]
[null,{"$f":"Rader!JU51","v":"Ludde 2"},{"$f":"Rader!JV51","v":0},{"$f":"Rader!JW51","v":0},{"$f":"Rader!JX51","v":0},{"$f":"Rader!JY51","v":0},{"$f":"Rader!JZ51","v":11}]
[null,{"$f":"Rader!KA51","v":"Alf B"},{"$f":"Rader!KB51","v":0},{"$f":"Rader!KC51","v":0},{"$f":"Rader!KD51","v":0},{"$f":"Rader!KE51","v":0},{"$f":"Rader!KF51","v":6}]
[null,{"$f":"Rader!KG51","v":"Maria I"},{"$f":"Rader!KH51","v":0},{"$f":"Rader!KI51","v":0},{"$f":"Rader!KJ51","v":0},{"$f":"Rader!KK51","v":0},{"$f":"Rader!KL51","v":3}]
[null,{"$f":"Rader!KM51","v":"Anne-Marie I"},{"$f":"Rader!KN51","v":0},{"$f":"Rader!KO51","v":0},{"$f":"Rader!KP51","v":0},{"$f":"Rader!KQ51","v":0},{"$f":"Rader!KR51","v":6}]
[null,{"$f":"Rader!KS51","v":"Lars, Kjell, Rolf"},{"$f":"Rader!KT51","v":0},{"$f":"Rader!KU51","v":0},{"$f":"Rader!KV51","v":0},{"$f":"Rader!KW51","v":0},{"$f":"Rader!KX51","v":6}]
[null,{"$f":"Rader!KY51","v":"Jan E"},{"$f":"Rader!KZ51","v":0},{"$f":"Rader!LA51","v":0},{"$f":"Rader!LB51","v":0},{"$f":"Rader!LC51","v":0},{"$f":"Rader!LD51","v":8}]
[null,{"$f":"Rader!LE51","v":"Rune Tjotta"},{"$f":"Rader!LF51","v":0},{"$f":"Rader!LG51","v":0},{"$f":"Rader!LH51","v":0},{"$f":"Rader!LI51","v":0},{"$f":"Rader!LJ51","v":9}]
[null,{"$f":"Rader!LK51","v":"Wiking"},{"$f":"Rader!LL51","v":0},{"$f":"Rader!LM51","v":0},{"$f":"Rader!LN51","v":0},{"$f":"Rader!LO51","v":0},{"$f":"Rader!LP51","v":8}]
[null,{"$f":"Rader!LQ51","v":"Janne L"},{"$f":"Rader!LR51","v":0},{"$f":"Rader!LS51","v":0},{"$f":"Rader!LT51","v":0},{"$f":"Rader!LU51","v":0},{"$f":"Rader!LV51","v":6}]
[null,{"$f":"Rader!LW51","v":"Eva W"},{"$f":"Rader!LX51","v":0},{"$f":"Rader!LY51","v":0},{"$f":"Rader!LZ51","v":0},{"$f":"Rader!MA51","v":0},{"$f":"Rader!MB51","v":3}]
[null,{"$f":"Rader!MC51","v":"Emma"},{"$f":"Rader!MD51","v":0},{"$f":"Rader!ME51","v":0},{"$f":"Rader!MF51","v":0},{"$f":"Rader!MG51","v":0},{"$f":"Rader!MH51","v":8}]

{"sheet":"Blad3","index":4,"n_rows":50,"n_cols":18,"rows_kept":50,"cut":false,"hidden":false,"merged":[[0,8,0,10],[0,12,0,14],[0,16,0,18],[0,3,0,5],[49,3,49,5]]}
[null,"Datum","Tid","Namn:"]
[null,"2018-06-14","Kl 17.00","Ryssland","-","Saudiarabien",null,null,null,"-",null,null,null,"-",null,null,null,"-"]
[null,"2018-06-15","Kl 14.00","Egypten",{"$f":"E2","v":"-"},"Uruguay",null,null,null,"-",null,null,null,"-",null,null,null,"-"]
[null,"2018-06-15","Kl 17.00","Marocko","-","Iran",null,null,null,"-",null,null,null,"-",null,null,null,"-"]
[null,"2018-06-15","Kl 20.00","Portugal","-","Spanien",null,null,null,"-",null,null,null,"-",null,null,null,"-"]
[null,"2018-06-16","Kl 12.00","Frankrike","-","Australien",null,null,null,"-",null,null,null,"-",null,null,null,"-"]
[null,"2018-06-16","Kl 15.00","Argentina","-","Island",null,null,null,"-",null,null,null,"-",null,null,null,"-"]
[null,"2018-06-16","Kl 18.00","Peru","-","Danmark",null,null,null,"-",null,null,null,"-",null,null,null,"-"]
[null,"2018-06-16","Kl 21.00","Kroatien","-","Nigeria",null,null,null,"-",null,null,null,"-",null,null,null,"-"]
[null,"2018-06-17","Kl 14.00","Costa Rica","-","Serbien",null,null,null,"-",null,null,null,"-",null,null,null,"-"]
[null,"2018-06-17","Kl 17.00","Tyskland","-","Mexiko",null,null,null,"-",null,null,null,"-",null,null,null,"-"]
[null,"2018-06-17","Kl 20.00","Brasilien","-","Schweiz",null,null,null,"-",null,null,null,"-",null,null,null,"-"]
[null,"2018-06-18","Kl 14.00","Sverige","-","Sydkorea",null,null,null,"-",null,null,null,"-",null,null,null,"-"]
[null,"2018-06-18","Kl 17.00","Belgien","-","Panama",null,null,null,"-",null,null,null,"-",null,null,null,"-"]
[null,"2018-06-18","Kl 20.00","Tunisien","-","England",null,null,null,"-",null,null,null,"-",null,null,null,"-"]
[null,"2018-06-19","Kl 14.00","Colombia","-","Japan",null,null,null,"-",null,null,null,"-",null,null,null,"-"]
[null,"2018-06-19","Kl 17.00","Polen","-","Senegal",null,null,null,"-",null,null,null,"-",null,null,null,"-"]
[null,"2018-06-19","Kl 20.00","Ryssland","-","Egypten",null,null,null,"-",null,null,null,"-",null,null,null,"-"]
[null,"2018-06-20","Kl 14.00","Portugal","-","Marocko",null,null,null,"-",null,null,null,"-",null,null,null,"-"]
[null,"2018-06-20","Kl 17.00","Uruguay","-","Saudiarabien",null,null,null,"-",null,null,null,"-",null,null,null,"-"]
[null,"2018-06-20","Kl 20.00","Iran","-","Spanien",null,null,null,"-",null,null,null,"-",null,null,null,"-"]
[null,"2018-06-21","Kl 14.00","Danmark","-","Australien",null,null,null,"-",null,null,null,"-",null,null,null,"-"]
[null,"2018-06-21","Kl 17.00","Frankrike","-","Peru",null,null,null,"-",null,null,null,"-",null,null,null,"-"]
[null,"2018-06-21","Kl 20.00","Argentina","-","Kroatien",null,null,null,"-",null,null,null,"-",null,null,null,"-"]
[null,"2018-06-22","Kl 14.00","Brasilien","-","Costa Rica",null,null,null,"-",null,null,null,"-",null,null,null,"-"]
[null,"2018-06-22","Kl 17.00","Nigeria",{"$f":"E25","v":"-"},"Island",null,null,null,"-",null,null,null,"-",null,null,null,"-"]
[null,"2018-06-22","Kl 20.00","Serbien","-","Schweiz",null,null,null,"-",null,null,null,"-",null,null,null,"-"]
[null,"2018-06-23","Kl 14.00","Belgien","-","Tunisien",null,null,null,"-",null,null,null,"-",null,null,null,"-"]
[null,"2018-06-23","Kl 17.00","Sydkorea","-","Mexiko",null,null,null,"-",null,null,null,"-",null,null,null,"-"]
[null,"2018-06-23","Kl 20.00","Tyskland","-","Sverige",null,null,null,"-",null,null,null,"-",null,null,null,"-"]
[null,"2018-06-24","Kl 14.00","England","-","Panama",null,null,null,"-",null,null,null,"-",null,null,null,"-"]
[null,"2018-06-24","Kl 17.00","Japan","-","Senegal",null,null,null,"-",null,null,null,"-",null,null,null,"-"]
[null,"2018-06-24","Kl 20.00","Polen","-","Colombia",null,null,null,"-",null,null,null,"-",null,null,null,"-"]
[null,"2018-06-25","Kl 16.00","Saudiarbien","-","Egypten",null,null,null,"-",null,null,null,"-",null,null,null,"-"]
[null,"2018-06-25","Kl 16.00","Uruguay","-","Ryssland",null,null,null,"-",null,null,null,"-",null,null,null,"-"]
[null,"2018-06-25","Kl 20.00","Spanien","-","Marocko",null,null,null,"-",null,null,null,"-",null,null,null,"-"]
[null,"2018-06-25","Kl 20.00","Iran","-","Portugal",null,null,null,"-",null,null,null,"-",null,null,null,"-"]
[null,"2018-06-26","Kl 16.00","Danmark","-","Frankrike",null,null,null,"-",null,null,null,"-",null,null,null,"-"]
[null,"2018-06-26","Kl 16.00","Australien","-","Peru",null,null,null,"-",null,null,null,"-",null,null,null,"-"]
[null,"2018-06-26","Kl 20.00","Island","-","Krotien",null,null,null,"-",null,null,null,"-",null,null,null,"-"]
[null,"2018-06-26","Kl 20.00","Nigeria","-","Argentina",null,null,null,"-",null,null,null,"-",null,null,null,"-"]
[null,"2018-06-27","Kl 16.00","Mexiko","-","Sverige",null,null,null,"-",null,null,null,"-",null,null,null,"-"]
[null,"2018-06-27","Kl 16.00","Sydkorea","-","Tyskland",null,null,null,"-",null,null,null,"-",null,null,null,"-"]
[null,"2018-06-27","Kl 20.00","Serbien","-","Brasilien",null,null,null,"-",null,null,null,"-",null,null,null,"-"]
[null,"2018-06-27","Kl 20.00","Schweiz","-","Costa Rica",null,null,null,"-",null,null,null,"-",null,null,null,"-"]
[null,"2018-06-28","Kl 16.00","Japan","-","Polen",null,null,null,"-",null,null,null,"-",null,null,null,"-"]
[null,"2018-06-28","Kl 16.00","Senegal","-","Colombia",null,null,null,"-",null,null,null,"-",null,null,null,"-"]
[null,"2018-06-28","Kl 20.00","Panama","-","Tunisien",null,null,null,"-",null,null,null,"-",null,null,null,"-"]
[null,"2018-06-28","Kl 20.00","England",null,"Belgien",null,null,null,"-",null,null,null,"-",null,null,null,"-"]
[null,null,null,"Vinnande land"]

{"sheet":"Blad5","index":5,"n_rows":60,"n_cols":8,"rows_kept":60,"cut":false,"hidden":false,"merged":[[1,5,1,7],[3,2,3,4]]}
[]
[null,null,null,null,null,"Nästa match på kupongen"]
[null,null,"Uppdaterat",null,null,{"$f":"Poängställning!R2","v":"2018-06-16"},null,{"$f":"Poängställning!T2","v":"Kl 12.00"}]
[null,null,{"$f":"NOW()","v":"2018-06-15T21:53:53.350"},null,null,{"$f":"Poängställning!R3","v":"Frankrike"},{"$f":"Poängställning!S3","v":"-"},{"$f":"Poängställning!T3","v":"Australien"}]
[null,null,{"$f":"Poängställning!B2","v":"Tommy T 2"}," ",{"$f":"Poängställning!G2","v":14},{"$f":"Poängställning!N2","v":2},{"$f":"Poängställning!O2","v":"-"},{"$f":"Poängställning!P2","v":1}]
[null,null,{"$f":"Poängställning!B3","v":"Pernilla"}," ",{"$f":"Poängställning!G3","v":14},{"$f":"Poängställning!N3","v":3},{"$f":"Poängställning!O3","v":"-"},{"$f":"Poängställning!P3","v":1}]
[null,null,{"$f":"Poängställning!B4","v":"Anitha"}," ",{"$f":"Poängställning!G4","v":12},{"$f":"Poängställning!N4","v":2},{"$f":"Poängställning!O4","v":"-"},{"$f":"Poängställning!P4","v":0}]
[null,null,{"$f":"Poängställning!B5","v":"Christian"}," ",{"$f":"Poängställning!G5","v":11},{"$f":"Poängställning!N5","v":1},{"$f":"Poängställning!O5","v":"-"},{"$f":"Poängställning!P5","v":0}]
[null,null,{"$f":"Poängställning!B6","v":"Lars L"}," ",{"$f":"Poängställning!G6","v":11},{"$f":"Poängställning!N6","v":3},{"$f":"Poängställning!O6","v":"-"},{"$f":"Poängställning!P6","v":1}]
[null,null,{"$f":"Poängställning!B7","v":"Mats-ola"}," ",{"$f":"Poängställning!G7","v":11},{"$f":"Poängställning!N7","v":2},{"$f":"Poängställning!O7","v":"-"},{"$f":"Poängställning!P7","v":1}]
[null,null,{"$f":"Poängställning!B8","v":"Ludde"}," ",{"$f":"Poängställning!G8","v":11},{"$f":"Poängställning!N8","v":2},{"$f":"Poängställning!O8","v":"-"},{"$f":"Poängställning!P8","v":1}]
[null,null,{"$f":"Poängställning!B9","v":"Hans Modh"}," ",{"$f":"Poängställning!G9","v":11},{"$f":"Poängställning!N9","v":2},{"$f":"Poängställning!O9","v":"-"},{"$f":"Poängställning!P9","v":0}]
[null,null,{"$f":"Poängställning!B10","v":"Ludde 2"}," ",{"$f":"Poängställning!G10","v":11},{"$f":"Poängställning!N10","v":2},{"$f":"Poängställning!O10","v":"-"},{"$f":"Poängställning!P10","v":1}]
[null,null,{"$f":"Poängställning!B11","v":"Mia E"}," ",{"$f":"Poängställning!G11","v":9},{"$f":"Poängställning!N11","v":4},{"$f":"Poängställning!O11","v":"-"},{"$f":"Poängställning!P11","v":1}]
[null,null,{"$f":"Poängställning!B12","v":"Tommy T 1"}," ",{"$f":"Poängställning!G12","v":9},{"$f":"Poängställning!N12","v":3},{"$f":"Poängställning!O12","v":"-"},{"$f":"Poängställning!P12","v":0}]
[null,null,{"$f":"Poängställning!B13","v":"Reino"}," ",{"$f":"Poängställning!G13","v":9},{"$f":"Poängställning!N13","v":2},{"$f":"Poängställning!O13","v":"-"},{"$f":"Poängställning!P13","v":1}]
[null,null,{"$f":"Poängställning!B14","v":"Jonny E"}," ",{"$f":"Poängställning!G14","v":9},{"$f":"Poängställning!N14","v":2},{"$f":"Poängställning!O14","v":"-"},{"$f":"Poängställning!P14","v":0}]
[null,null,{"$f":"Poängställning!B15","v":"Romee"}," ",{"$f":"Poängställning!G15","v":9},{"$f":"Poängställning!N15","v":3},{"$f":"Poängställning!O15","v":"-"},{"$f":"Poängställning!P15","v":1}]
[null,null,{"$f":"Poängställning!B16","v":"Christer 2"}," ",{"$f":"Poängställning!G16","v":9},{"$f":"Poängställning!N16","v":4},{"$f":"Poängställning!O16","v":"-"},{"$f":"Poängställning!P16","v":0}]
[null,null,{"$f":"Poängställning!B17","v":"Tina"}," ",{"$f":"Poängställning!G17","v":9},{"$f":"Poängställning!N17","v":2},{"$f":"Poängställning!O17","v":"-"},{"$f":"Poängställning!P17","v":0}]
[null,null,{"$f":"Poängställning!B18","v":"Monika A"}," ",{"$f":"Poängställning!G18","v":9},{"$f":"Poängställning!N18","v":2},{"$f":"Poängställning!O18","v":"-"},{"$f":"Poängställning!P18","v":0}]
[null,null,{"$f":"Poängställning!B19","v":"Torvald"}," ",{"$f":"Poängställning!G19","v":9},{"$f":"Poängställning!N19","v":2},{"$f":"Poängställning!O19","v":"-"},{"$f":"Poängställning!P19","v":0}]
[null,null,{"$f":"Poängställning!B20","v":"Stefan L"}," ",{"$f":"Poängställning!G20","v":9},{"$f":"Poängställning!N20","v":2},{"$f":"Poängställning!O20","v":"-"},{"$f":"Poängställning!P20","v":1}]
[null,null,{"$f":"Poängställning!B21","v":"Lennart C1"}," ",{"$f":"Poängställning!G21","v":9},{"$f":"Poängställning!N21","v":2},{"$f":"Poängställning!O21","v":"-"},{"$f":"Poängställning!P21","v":1}]
[null,null,{"$f":"Poängställning!B22","v":"Andreas"}," ",{"$f":"Poängställning!G22","v":9},{"$f":"Poängställning!N22","v":4},{"$f":"Poängställning!O22","v":"-"},{"$f":"Poängställning!P22","v":0}]
[null,null,{"$f":"Poängställning!B23","v":"Rune Tjotta"}," ",{"$f":"Poängställning!G23","v":9},{"$f":"Poängställning!N23","v":3},{"$f":"Poängställning!O23","v":"-"},{"$f":"Poängställning!P23","v":0}]
[null,null,{"$f":"Poängställning!B24","v":"Jessica"}," ",{"$f":"Poängställning!G24","v":8},{"$f":"Poängställning!N24","v":2},{"$f":"Poängställning!O24","v":"-"},{"$f":"Poängställning!P24","v":1}]
[null,null,{"$f":"Poängställning!B25","v":"Till minne av Esbjörn"}," ",{"$f":"Poängställning!G25","v":8},{"$f":"Poängställning!N25","v":1},{"$f":"Poängställning!O25","v":"-"},{"$f":"Poängställning!P25","v":0}]
[null,null,{"$f":"Poängställning!B26","v":"Gustav"}," ",{"$f":"Poängställning!G26","v":8},{"$f":"Poängställning!N26","v":3},{"$f":"Poängställning!O26","v":"-"},{"$f":"Poängställning!P26","v":0}]
[null,null,{"$f":"Poängställning!B27","v":"Jan E"}," ",{"$f":"Poängställning!G27","v":8},{"$f":"Poängställning!N27","v":2},{"$f":"Poängställning!O27","v":"-"},{"$f":"Poängställning!P27","v":1}]
[null,null,{"$f":"Poängställning!B28","v":"Wiking"}," ",{"$f":"Poängställning!G28","v":8},{"$f":"Poängställning!N28","v":2},{"$f":"Poängställning!O28","v":"-"},{"$f":"Poängställning!P28","v":0}]
[null,null,{"$f":"Poängställning!B29","v":"Emma"}," ",{"$f":"Poängställning!G29","v":8},{"$f":"Poängställning!N29","v":1},{"$f":"Poängställning!O29","v":"-"},{"$f":"Poängställning!P29","v":0}]
[null,null,{"$f":"Poängställning!B30","v":"Roger W"}," ",{"$f":"Poängställning!G30","v":6},{"$f":"Poängställning!N30","v":3},{"$f":"Poängställning!O30","v":"-"},{"$f":"Poängställning!P30","v":1}]
[null,null,{"$f":"Poängställning!B31","v":"Roger W 2"}," ",{"$f":"Poängställning!G31","v":6},{"$f":"Poängställning!N31","v":2},{"$f":"Poängställning!O31","v":"-"},{"$f":"Poängställning!P31","v":0}]
[null,null,{"$f":"Poängställning!B32","v":"Lars Haglund"}," ",{"$f":"Poängställning!G32","v":6},{"$f":"Poängställning!N32","v":2},{"$f":"Poängställning!O32","v":"-"},{"$f":"Poängställning!P32","v":0}]
[null,null,{"$f":"Poängställning!B33","v":"Arne E"}," ",{"$f":"Poängställning!G33","v":6},{"$f":"Poängställning!N33","v":4},{"$f":"Poängställning!O33","v":"-"},{"$f":"Poängställning!P33","v":2}]
[null,null,{"$f":"Poängställning!B34","v":"Jonte"}," ",{"$f":"Poängställning!G34","v":6},{"$f":"Poängställning!N34","v":2},{"$f":"Poängställning!O34","v":"-"},{"$f":"Poängställning!P34","v":1}]
[null,null,{"$f":"Poängställning!B35","v":"Jonas M"}," ",{"$f":"Poängställning!G35","v":6},{"$f":"Poängställning!N35","v":4},{"$f":"Poängställning!O35","v":"-"},{"$f":"Poängställning!P35","v":1}]
[null,null,{"$f":"Poängställning!B36","v":"Johan G"}," ",{"$f":"Poängställning!G36","v":6},{"$f":"Poängställning!N36","v":4},{"$f":"Poängställning!O36","v":"-"},{"$f":"Poängställning!P36","v":0}]
[null,null,{"$f":"Poängställning!B37","v":"Edvin A"}," ",{"$f":"Poängställning!G37","v":6},{"$f":"Poängställning!N37","v":2},{"$f":"Poängställning!O37","v":"-"},{"$f":"Poängställning!P37","v":0}]
[null,null,{"$f":"Poängställning!B38","v":"Dick W1"}," ",{"$f":"Poängställning!G38","v":6},{"$f":"Poängställning!N38","v":3},{"$f":"Poängställning!O38","v":"-"},{"$f":"Poängställning!P38","v":0}]
[null,null,{"$f":"Poängställning!B39","v":"Dick W2"}," ",{"$f":"Poängställning!G39","v":6},{"$f":"Poängställning!N39","v":2},{"$f":"Poängställning!O39","v":"-"},{"$f":"Poängställning!P39","v":3}]
[null,null,{"$f":"Poängställning!B40","v":"Bo Jansson"}," ",{"$f":"Poängställning!G40","v":6},{"$f":"Poängställning!N40","v":3},{"$f":"Poängställning!O40","v":"-"},{"$f":"Poängställning!P40","v":0}]
[null,null,{"$f":"Poängställning!B41","v":"Lennart C3"}," ",{"$f":"Poängställning!G41","v":6},{"$f":"Poängställning!N41","v":1},{"$f":"Poängställning!O41","v":"-"},{"$f":"Poängställning!P41","v":1}]
[null,null,{"$f":"Poängställning!B42","v":"Sonny "}," ",{"$f":"Poängställning!G42","v":6},{"$f":"Poängställning!N42","v":2},{"$f":"Poängställning!O42","v":"-"},{"$f":"Poängställning!P42","v":0}]
[null,null,{"$f":"Poängställning!B43","v":"Monica Modh"}," ",{"$f":"Poängställning!G43","v":6},{"$f":"Poängställning!N43","v":2},{"$f":"Poängställning!O43","v":"-"},{"$f":"Poängställning!P43","v":0}]
[null,null,{"$f":"Poängställning!B44","v":"Alf B"}," ",{"$f":"Poängställning!G44","v":6},{"$f":"Poängställning!N44","v":4},{"$f":"Poängställning!O44","v":"-"},{"$f":"Poängställning!P44","v":1}]
[null,null,{"$f":"Poängställning!B45","v":"Anne-Marie I"}," ",{"$f":"Poängställning!G45","v":6},{"$f":"Poängställning!N45","v":3},{"$f":"Poängställning!O45","v":"-"},{"$f":"Poängställning!P45","v":2}]
[null,null,{"$f":"Poängställning!B46","v":"Lars, Kjell, Rolf"}," ",{"$f":"Poängställning!G46","v":6},{"$f":"Poängställning!N46","v":3},{"$f":"Poängställning!O46","v":"-"},{"$f":"Poängställning!P46","v":1}]
[null,null,{"$f":"Poängställning!B47","v":"Janne L"}," ",{"$f":"Poängställning!G47","v":6},{"$f":"Poängställning!N47","v":3},{"$f":"Poängställning!O47","v":"-"},{"$f":"Poängställning!P47","v":0}]
[null,null,{"$f":"Poängställning!B48","v":"Manfreed"}," ",{"$f":"Poängställning!G48","v":3},{"$f":"Poängställning!N48","v":1},{"$f":"Poängställning!O48","v":"-"},{"$f":"Poängställning!P48","v":0}]
[null,null,{"$f":"Poängställning!B49","v":"Tommy T 3"}," ",{"$f":"Poängställning!G49","v":3},{"$f":"Poängställning!N49","v":2},{"$f":"Poängställning!O49","v":"-"},{"$f":"Poängställning!P49","v":0}]
[null,null,{"$f":"Poängställning!B50","v":"Bo Fransson"}," ",{"$f":"Poängställning!G50","v":3},{"$f":"Poängställning!N50","v":2},{"$f":"Poängställning!O50","v":"-"},{"$f":"Poängställning!P50","v":0}]
[null,null,{"$f":"Poängställning!B51","v":"Mika"}," ",{"$f":"Poängställning!G51","v":3},{"$f":"Poängställning!N51","v":3},{"$f":"Poängställning!O51","v":"-"},{"$f":"Poängställning!P51","v":0}]
[null,null,{"$f":"Poängställning!B52","v":"Jappe"}," ",{"$f":"Poängställning!G52","v":3},{"$f":"Poängställning!N52","v":1},{"$f":"Poängställning!O52","v":"-"},{"$f":"Poängställning!P52","v":0}]
[null,null,{"$f":"Poängställning!B53","v":"Gille"}," ",{"$f":"Poängställning!G53","v":3},{"$f":"Poängställning!N53","v":2},{"$f":"Poängställning!O53","v":"-"},{"$f":"Poängställning!P53","v":0}]
[null,null,{"$f":"Poängställning!B54","v":"Maria I"}," ",{"$f":"Poängställning!G54","v":3},{"$f":"Poängställning!N54","v":4},{"$f":"Poängställning!O54","v":"-"},{"$f":"Poängställning!P54","v":3}]
[null,null,{"$f":"Poängställning!B55","v":"Eva W"}," ",{"$f":"Poängställning!G55","v":3},{"$f":"Poängställning!N55","v":2},{"$f":"Poängställning!O55","v":"-"},{"$f":"Poängställning!P55","v":0}]
[null,null,{"$f":"Poängställning!B56","v":"Christer 1"}," ",{"$f":"Poängställning!G56","v":0},{"$f":"Poängställning!N56","v":3},{"$f":"Poängställning!O56","v":"-"},{"$f":"Poängställning!P56","v":0}]
[null,null,{"$f":"Poängställning!B57","v":"Lennart C2"}," ",{"$f":"Poängställning!G57","v":0},{"$f":"Poängställning!N57","v":3},{"$f":"Poängställning!O57","v":"-"},{"$f":"Poängställning!P57","v":0}]

{"sheet":"Blad4","index":6,"n_rows":0,"n_cols":0,"rows_kept":0,"cut":false,"hidden":false,"merged":[]}