{"text_format":"1","workbook":"xlsx","n_sheets":7,"sheets":["Rader","Blad1","Poängställning","Blad2","Blad3","Blad5","Blad4"],"not_rendered":{"charts":0,"images":0,"macros":1,"external_links":0,"defined_names":0,"comments":0,"pivot_tables":0},"unopened":[],"bounds":{"document_bytes":16777216,"sheet_cells":100000,"rows_first":2000,"rows_last":500,"rows_between":2000,"halvings":0,"cell_chars":16384,"cell_head_chars":4096},"cells_cut":0,"cells_raw":0,"read":"whole","date_system":"1900"}

{"sheet":"Rader","index":0,"n_rows":56,"n_cols":346,"rows_kept":56,"cut":false,"hidden":false,"merged":[[49,340,49,342],[50,340,50,342],[0,340,0,345],[0,328,0,333],[0,334,0,339],[49,328,49,330],[49,334,49,336],[50,334,50,336],[49,286,49,288],[49,292,49,294],[49,298,49,300],[49,304,49,306],[50,286,50,288],[50,292,50,294],[50,304,50,306],[50,310,50,312],[50,256,50,259],[50,262,50,265],[50,268,50,271],[50,274,50,277],[49,280,49,282],[50,280,50,284],[0,316,0,321],[0,322,0,327],[49,256,49,259],[49,262,49,265],[49,268,49,271],[49,274,49,277],[49,310,49,312],[49,316,49,318],[49,322,49,324],[0,286,0,291],[0,292,0,297],[0,298,0,303],[0,304,0,309],[0,310,0,315],[0,256,0,261],[0,262,0,267],[0,268,0,273],[0,274,0,279],[0,280,0,285],[0,130,0,135],[0,172,0,177],[0,202,0,207],[0,208,0,213],[0,22,0,27],[0,28,0,33],[0,34,0,39],[0,76,0,81],[0,82,0,87],[49,5,49,7],[0,40,0,45],[0,46,0,51],[0,52,0,57],[0,5,0,7],[0,16,0,21],[0,0,0,4],[0,244,0,249],[0,232,0,237],[0,58,0,63],[0,64,0,69],[0,136,0,141],[0,70,0,75],[0,112,0,117],[0,118,0,123],[0,124,0,129],[0,220,0,225],[0,88,0,93],[0,94,0,99],[0,100,0,105],[0,106,0,111],[0,178,0,183],[0,250,0,255],[0,184,0,189],[0,142,0,147],[0,148,0,153],[0,154,0,159],[0,160,0,165],[0,238,0,243],[0,226,0,231],[0,190,0,195],[0,196,0,201],[0,166,0,171],[0,214,0,219]]}
["Fyll i rätt resultat här till höger!",null,null,null,null,"Resultat",null,null,null,null,"Christian",null,null,null,null,null,"Manfreed",null,null,null,null,null,"Jessica",null,null,null,null,null,"Mia E",null,null,null,null,null,"Till minne av Esbjörn",null,null,null,null,null,"Lars L",null,null,null,null,null,"Roger W",null,null,null,null,null,"Roger W 2",null,null,null,null,null,"Tommy T 1",null,null,null,null,null,"Tommy T 2",null,null,null,null,null,"Tommy T 3",null,null,null,null,null,"Reino",null,null,null,null,null,"Lars Haglund",null,null,null,null,null,"Bo Fransson",null,null,null,null,null,"Arne E",null,null,null,null,null,"Jonny E",null,null,null,null,null,"Jonte",null,null,null,null,null,"Mats-ola",null,null,null,null,null,"Mika",null,null,null,null,null,"Romee",null,null,null,null,null,"Anitha",null,null,null,null,null,"Ludde",null,null,null,null,null,"Jonas M",null,null,null,null,null,"Johan G",null,null,null,null,null,"Pernilla",null,null,null,null,null,"Christer 1",null,null,null,null,null,"Christer 2",null,null,null,null,null,"Tina",null,null,null,null,null,"Monika A",null,null,null,null,null,"Edvin A",null,null,null,null,null,"Gustav",null,null,null,null,null,"Torvald",null,null,null,null,null,"Stefan L",null,null,null,null,null,"Dick W1",null,null,null,null,null,"Dick W2",null,null,null,null,null,"Bo Jansson",null,null,null,null,null,"Lennart C1",null,null,null,null,null,"Lennart C2",null,null,null,null,null,"Lennart C3",null,null,null,null,null,"Sonny ",null,null,null,null,null,"Jappe",null,null,null,null,null,"Hans Modh",null,null,null,null,null,"Monica Modh",null,null,null,null,null,"Gille",null,null,null,null,null,"Andreas",null,null,null,null,null,"Ludde 2",null,null,null,null,null,"Alf B",null,null,null,null,null,"Maria I",null,null,null,null,null,"Anne-Marie I",null,null,null,null,null,"Lars, Kjell, Rolf",null,null,null,null,null,"Jan E",null,null,null,null,null,"Rune Tjotta",null,null,null,null,null,"Wiking",null,null,null,null,null,"Janne L",null,null,null,null,null,"Eva W",null,null,null,null,null,"Emma"]
["2018-06-14","Kl 17.00","Ryssland","-","Saudiarabien",5,"-",0,null,{"$f":"IF(F2=\" \",0,IF(F2=H2,\"X\",IF(F2>H2,1,2)))","v":1},2,"-",0,null,{"$f":"IF(K2=M2,\"X\",IF(K2>M2,1,2))","v":1},{"$f":"IF($F2=K2,IF($H2=M2,5,IF($J2=O2,3,0)),IF($J2=O2,3,0))","v":3},1,"-",2,null,{"$f":"IF(Q2=S2,\"X\",IF(Q2>S2,1,2))","v":2},{"$f":"IF($F2=Q2,IF($H2=S2,5,IF($J2=U2,3,0)),IF($J2=U2,3,0))","v":0},2,"-",1,null,{"$f":"IF(W2=Y2,\"X\",IF(W2>Y2,1,2))","v":1},{"$f":"IF($F2=W2,IF($H2=Y2,5,IF($J2=AA2,3,0)),IF($J2=AA2,3,0))","v":3},2,"-",1,null,{"$f":"IF(AC2=AE2,\"X\",IF(AC2>AE2,1,2))","v":1},{"$f":"IF($F2=AC2,IF($H2=AE2,5,IF($J2=AG2,3,0)),IF($J2=AG2,3,0))","v":3},1,"-",0,null,{"$f":"IF(AI2=AK2,\"X\",IF(AI2>AK2,1,2))","v":1},{"$f":"IF($F2=AI2,IF($H2=AK2,5,IF($J2=AM2,3,0)),IF($J2=AM2,3,0))","v":3},2,"-",0,null,{"$f":"IF(AO2=AQ2,\"X\",IF(AO2>AQ2,1,2))","v":1},{"$f":"IF($F2=AO2,IF($H2=AQ2,5,IF($J2=AS2,3,0)),IF($J2=AS2,3,0))","v":3},3,"-",0,null,{"$f":"IF(AU2=AW2,\"X\",IF(AU2>AW2,1,2))","v":1},{"$f":"IF($F2=AU2,IF($H2=AW2,5,IF($J2=AY2,3,0)),IF($J2=AY2,3,0))","v":3},2,"-",1,null,{"$f":"IF(BA2=BC2,\"X\",IF(BA2>BC2,1,2))","v":1},{"$f":"IF($F2=BA2,IF($H2=BC2,5,IF($J2=BE2,3,0)),IF($J2=BE2,3,0))","v":3},2,"-",0,null,{"$f":"IF(BG2=BI2,\"X\",IF(BG2>BI2,1,2))","v":1},{"$f":"IF($F2=BG2,IF($H2=BI2,5,IF($J2=BK2,3,0)),IF($J2=BK2,3,0))","v":3},3,"-",2,null,{"$f":"IF(BM2=BO2,\"X\",IF(BM2>BO2,1,2))","v":1},{"$f":"IF($F2=BM2,IF($H2=BO2,5,IF($J2=BQ2,3,0)),IF($J2=BQ2,3,0))","v":3},1,"-",0,null,{"$f":"IF(BS2=BU2,\"X\",IF(BS2>BU2,1,2))","v":1},{"$f":"IF($F2=BS2,IF($H2=BU2,5,IF($J2=BW2,3,0)),IF($J2=BW2,3,0))","v":3},2,"-",1,null,{"$f":"IF(BY2=CA2,\"X\",IF(BY2>CA2,1,2))","v":1},{"$f":"IF($F2=BY2,IF($H2=CA2,5,IF($J2=CC2,3,0)),IF($J2=CC2,3,0))","v":3},2,"-",1,null,{"$f":"IF(CE2=CG2,\"X\",IF(CE2>CG2,1,2))","v":1},{"$f":"IF($F2=CE2,IF($H2=CG2,5,IF($J2=CI2,3,0)),IF($J2=CI2,3,0))","v":3},1,"-",1,null,{"$f":"IF(CK2=CM2,\"X\",IF(CK2>CM2,1,2))","v":"X"},{"$f":"IF($F2=CK2,IF($H2=CM2,5,IF($J2=CO2,3,0)),IF($J2=CO2,3,0))","v":0},3,"-",0,null,{"$f":"IF(CQ2=CS2,\"X\",IF(CQ2>CS2,1,2))","v":1},{"$f":"IF($F2=CQ2,IF($H2=CS2,5,IF($J2=CU2,3,0)),IF($J2=CU2,3,0))","v":3},3,"-",1,null,{"$f":"IF(CW2=CY2,\"X\",IF(CW2>CY2,1,2))","v":1},{"$f":"IF($F2=CW2,IF($H2=CY2,5,IF($J2=DA2,3,0)),IF($J2=DA2,3,0))","v":3},2,"-",0,null,{"$f":"IF(DC2=DE2,\"X\",IF(DC2>DE2,1,2))","v":1},{"$f":"IF($F2=DC2,IF($H2=DE2,5,IF($J2=DG2,3,0)),IF($J2=DG2,3,0))","v":3},3,"-",0,null,{"$f":"IF(DI2=DK2,\"X\",IF(DI2>DK2,1,2))","v":1},{"$f":"IF($F2=DI2,IF($H2=DK2,5,IF($J2=DM2,3,0)),IF($J2=DM2,3,0))","v":3},2,"-",1,null,{"$f":"IF(DO2=DQ2,\"X\",IF(DO2>DQ2,1,2))","v":1},{"$f":"IF($F2=DO2,IF($H2=DQ2,5,IF($J2=DS2,3,0)),IF($J2=DS2,3,0))","v":3},1,"-",0,null,{"$f":"IF(DU2=DW2,\"X\",IF(DU2>DW2,1,2))","v":1},{"$f":"IF($F2=DU2,IF($H2=DW2,5,IF($J2=DY2,3,0)),IF($J2=DY2,3,0))","v":3},2,"-",1,null,{"$f":"IF(EA2=EC2,\"X\",IF(EA2>EC2,1,2))","v":1},{"$f":"IF($F2=EA2,IF($H2=EC2,5,IF($J2=EE2,3,0)),IF($J2=EE2,3,0))","v":3},2,"-",1,null,{"$f":"IF(EG2=EI2,\"X\",IF(EG2>EI2,1,2))","v":1},{"$f":"IF($F2=EG2,IF($H2=EI2,5,IF($J2=EK2,3,0)),IF($J2=EK2,3,0))","v":3},2,"-",0,null,{"$f":"IF(EM2=EO2,\"X\",IF(EM2>EO2,1,2))","v":1},{"$f":"IF($F2=EM2,IF($H2=EO2,5,IF($J2=EQ2,3,0)),IF($J2=EQ2,3,0))","v":3},2,"-",0,null,{"$f":"IF(ES2=EU2,\"X\",IF(ES2>EU2,1,2))","v":1},{"$f":"IF($F2=ES2,IF($H2=EU2,5,IF($J2=EW2,3,0)),IF($J2=EW2,3,0))","v":3},2,"-",1,null,{"$f":"IF(EY2=FA2,\"X\",IF(EY2>FA2,1,2))","v":1},{"$f":"IF($F2=EY2,IF($H2=FA2,5,IF($J2=FC2,3,0)),IF($J2=FC2,3,0))","v":3},1,"-",1,null,{"$f":"IF(FE2=FG2,\"X\",IF(FE2>FG2,1,2))","v":"X"},{"$f":"IF($F2=FE2,IF($H2=FG2,5,IF($J2=FI2,3,0)),IF($J2=FI2,3,0))","v":0},2,"-",1,null,{"$f":"IF(FK2=FM2,\"X\",IF(FK2>FM2,1,2))","v":1},{"$f":"IF($F2=FK2,IF($H2=FM2,5,IF($J2=FO2,3,0)),IF($J2=FO2,3,0))","v":3},1,"-",0,null,{"$f":"IF(FQ2=FS2,\"X\",IF(FQ2>FS2,1,2))","v":1},{"$f":"IF($F2=FQ2,IF($H2=FS2,5,IF($J2=FU2,3,0)),IF($J2=FU2,3,0))","v":3},1,"-",0,null,{"$f":"IF(FW2=FY2,\"X\",IF(FW2>FY2,1,2))","v":1},{"$f":"IF($F2=FW2,IF($H2=FY2,5,IF($J2=GA2,3,0)),IF($J2=GA2,3,0))","v":3},2,"-",0,null,{"$f":"IF(GC2=GE2,\"X\",IF(GC2>GE2,1,2))","v":1},{"$f":"IF($F2=GC2,IF($H2=GE2,5,IF($J2=GG2,3,0)),IF($J2=GG2,3,0))","v":3},2,"-",1,null,{"$f":"IF(GI2=GK2,\"X\",IF(GI2>GK2,1,2))","v":1},{"$f":"IF($F2=GI2,IF($H2=GK2,5,IF($J2=GM2,3,0)),IF($J2=GM2,3,0))","v":3},2,"-",0,null,{"$f":"IF(GO2=GQ2,\"X\",IF(GO2>GQ2,1,2))","v":1},{"$f":"IF($F2=GO2,IF($H2=GQ2,5,IF($J2=GS2,3,0)),IF($J2=GS2,3,0))","v":3},1,"-",0,null,{"$f":"IF(GU2=GW2,\"X\",IF(GU2>GW2,1,2))","v":1},{"$f":"IF($F2=GU2,IF($H2=GW2,5,IF($J2=GY2,3,0)),IF($J2=GY2,3,0))","v":3},3,"-",1,null,{"$f":"IF(HA2=HC2,\"X\",IF(HA2>HC2,1,2))","v":1},{"$f":"IF($F2=HA2,IF($H2=HC2,5,IF($J2=HE2,3,0)),IF($J2=HE2,3,0))","v":3},3,"-",1,null,{"$f":"IF(HG2=HI2,\"X\",IF(HG2>HI2,1,2))","v":1},{"$f":"IF($F2=HG2,IF($H2=HI2,5,IF($J2=HK2,3,0)),IF($J2=HK2,3,0))","v":3},1,"-",0,null,{"$f":"IF(HM2=HO2,\"X\",IF(HM2>HO2,1,2))","v":1},{"$f":"IF($F2=HM2,IF($H2=HO2,5,IF($J2=HQ2,3,0)),IF($J2=HQ2,3,0))","v":3},3,"-",0,null,{"$f":"IF(HS2=HU2,\"X\",IF(HS2>HU2,1,2))","v":1},{"$f":"IF($F2=HS2,IF($H2=HU2,5,IF($J2=HW2,3,0)),IF($J2=HW2,3,0))","v":3},1,"-",2,null,{"$f":"IF(HY2=IA2,\"X\",IF(HY2>IA2,1,2))","v":2},{"$f":"IF($F2=HY2,IF($H2=IA2,5,IF($J2=IC2,3,0)),IF($J2=IC2,3,0))","v":0},2,"-",2,null,{"$f":"IF(IE2=IG2,\"X\",IF(IE2>IG2,1,2))","v":"X"},{"$f":"IF($F2=IE2,IF($H2=IG2,5,IF($J2=II2,3,0)),IF($J2=II2,3,0))","v":0},1,"-",0,null,{"$f":"IF(IK2=IM2,\"X\",IF(IK2>IM2,1,2))","v":1},{"$f":"IF($F2=IK2,IF($H2=IM2,5,IF($J2=IO2,3,0)),IF($J2=IO2,3,0))","v":3},2,"-",0,null,{"$f":"IF(IQ2=IS2,\"X\",IF(IQ2>IS2,1,2))","v":1},{"$f":"IF($F2=IQ2,IF($H2=IS2,5,IF($J2=IU2,3,0)),IF($J2=IU2,3,0))","v":3},2,"-",0,null,{"$f":"IF(IW2=IY2,\"X\",IF(IW2>IY2,1,2))","v":1},{"$f":"IF($F2=IW2,IF($H2=IY2,5,IF($J2=JA2,3,0)),IF($J2=JA2,3,0))","v":3},2,"-",2,null,{"$f":"IF(JC2=JE2,\"X\",IF(JC2>JE2,1,2))","v":"X"},{"$f":"IF($F2=JC2,IF($H2=JE2,5,IF($J2=JG2,3,0)),IF($J2=JG2,3,0))","v":0},2,"-",1,null,{"$f":"IF(JI2=JK2,\"X\",IF(JI2>JK2,1,2))","v":1},{"$f":"IF($F2=JI2,IF($H2=JK2,5,IF($J2=JM2,3,0)),IF($J2=JM2,3,0))","v":3},2,"-",0,null,{"$f":"IF(JO2=JQ2,\"X\",IF(JO2>JQ2,1,2))","v":1},{"$f":"IF($F2=JO2,IF($H2=JQ2,5,IF($J2=JS2,3,0)),IF($J2=JS2,3,0))","v":3},2,"-",1,null,{"$f":"IF(JU2=JW2,\"X\",IF(JU2>JW2,1,2))","v":1},{"$f":"IF($F2=JU2,IF($H2=JW2,5,IF($J2=JY2,3,0)),IF($J2=JY2,3,0))","v":3},5,"-",2,null,{"$f":"IF(KA2=KC2,\"X\",IF(KA2>KC2,1,2))","v":1},{"$f":"IF($F2=KA2,IF($H2=KC2,5,IF($J2=KE2,3,0)),IF($J2=KE2,3,0))","v":3},2,"-",2,null,{"$f":"IF(KG2=KI2,\"X\",IF(KG2>KI2,1,2))","v":"X"},{"$f":"IF($F2=KG2,IF($H2=KI2,5,IF($J2=KK2,3,0)),IF($J2=KK2,3,0))","v":0},1,"-",0,null,{"$f":"IF(KM2=KO2,\"X\",IF(KM2>KO2,1,2))","v":1},{"$f":"IF($F2=KM2,IF($H2=KO2,5,IF($J2=KQ2,3,0)),IF($J2=KQ2,3,0))","v":3},2,"-",0,null,{"$f":"IF(KS2=KU2,\"X\",IF(KS2>KU2,1,2))","v":1},{"$f":"IF($F2=KS2,IF($H2=KU2,5,IF($J2=KW2,3,0)),IF($J2=KW2,3,0))","v":3},1,"-",0,null,{"$f":"IF(KY2=LA2,\"X\",IF(KY2>LA2,1,2))","v":1},{"$f":"IF($F2=KY2,IF($H2=LA2,5,IF($J2=LC2,3,0)),IF($J2=LC2,3,0))","v":3},2,"-",0,null,{"$f":"IF(LE2=LG2,\"X\",IF(LE2>LG2,1,2))","v":1},{"$f":"IF($F2=LE2,IF($H2=LG2,5,IF($J2=LI2,3,0)),IF($J2=LI2,3,0))","v":3},1,"-",0,null,{"$f":"IF(LK2=LM2,\"X\",IF(LK2>LM2,1,2))","v":1},{"$f":"IF($F2=LK2,IF($H2=LM2,5,IF($J2=LO2,3,0)),IF($J2=LO2,3,0))","v":3},2,"-",1,null,{"$f":"IF(LQ2=LS2,\"X\",IF(LQ2>LS2,1,2))","v":1},{"$f":"IF($F2=LQ2,IF($H2=LS2,5,IF($J2=LU2,3,0)),IF($J2=LU2,3,0))","v":3},1,"-",2,null,{"$f":"IF(LW2=LY2,\"X\",IF(LW2>LY2,1,2))","v":2},{"$f":"IF($F2=LW2,IF($H2=LY2,5,IF($J2=MA2,3,0)),IF($J2=MA2,3,0))","v":0},1,"-",0,null,{"$f":"IF(MC2=ME2,\"X\",IF(MC2>ME2,1,2))","v":1},{"$f":"IF($F2=MC2,IF($H2=ME2,5,IF($J2=MG2,3,0)),IF($J2=MG2,3,0))","v":3}]
["2018-06-15","Kl 14.00","Egypten",{"$f":"D2","v":"-"},"Uruguay",0,"-",1,null,2,0,"-",1,null,2,{"$f":"IF($F3=K3,IF($H3=M3,5,IF($J3=O3,3,0)),IF($J3=O3,3,0))","v":5},2,"-",0,null,1,{"$f":"IF($F3=Q3,IF($H3=S3,5,IF($J3=U3,3,0)),IF($J3=U3,3,0))","v":0},1,"-",1,null,"X",0,1,"-",1,null,"X",0,0,"-",1,null,2,5,0,"-",1,null,2,5,2,"-",2,null,"X",0,0,"-",0,null,"X",0,1,"-",1,null,"X",0,0,"-",4,null,2,3,2,"-",2,null,"X",0,1,"-",2,null,2,3,1,"-",2,null,2,3,0,"-",3,null,2,3,1,"-",4,null,2,3,1,"-",2,null,2,3,1,"-",0,null,1,0,0,"-",1,null,2,5,1,"-",1,null,"X",0,2,"-",2,null,"X",0,1,"-",3,null,2,3,1,"-",2,null,2,3,1,"-",3,null,2,3,1,"-",3,null,2,3,0,"-",3,null,2,3,2,"-",1,null,1,0,1,"-",1,null,"X",0,0,"-",2,null,2,3,0,"-",2,null,2,3,0,"-",2,null,2,3,0,"-",1,null,2,5,0,"-",2,null,2,3,0,"-",2,null,2,3,0,"-",2,null,2,3,2,"-",4,null,2,3,0,"-",0,null,"X",0,0,"-",2,null,2,3,1,"-",1,null,"X",0,1,"-",3,null,2,3,0,"-",0,null,"X",0,1,"-",1,null,"X",0,0,"-",1,null,2,5,0,"-",2,null,2,3,1,"-",1,null,"X",0,1,"-",2,null,2,3,1,"-",2,null,2,3,1,"-",3,null,2,3,1,"-",3,null,2,3,1,"-",2,null,2,3,0,"-",3,null,2,3,0,"-",1,null,2,5,1,"-",3,null,2,3,0,"-",1,null,2,5,1,"-",2,null,2,3,1,"-",0,null,1,0,0,"-",1,null,2,5]
["2018-06-15","Kl 17.00","Marocko","-","Iran",0,"-",1,null,2,1,"-",1,null,"X",0,0,"-",2,null,2,3,0,"-",1,null,2,5,1,"-",3,null,2,3,2,"-",1,null,1,0,0,"-",0,null,"X",0,2,"-",1,null,1,0,1,"-",0,null,1,0,1,"-",2,null,2,3,1,"-",3,null,2,3,1,"-",1,null,"X",0,1,"-",2,null,2,3,1,"-",1,null,"X",0,2,"-",0,null,1,0,2,"-",2,null,"X",0,2,"-",0,null,1,0,1,"-",1,null,"X",0,3,"-",1,null,1,0,1,"-",0,null,1,0,1,"-",2,null,2,3,1,"-",2,null,2,3,0,"-",1,null,2,5,3,"-",2,null,1,0,2,"-",2,null,"X",0,0,"-",1,null,2,5,1,"-",1,null,"X",0,1,"-",2,null,2,3,0,"-",3,null,2,3,1,"-",1,null,"X",0,1,"-",0,null,1,0,1,"-",0,null,1,0,2,"-",1,null,1,0,1,"-",0,null,1,0,1,"-",1,null,"X",0,2,"-",2,null,"X",0,2,"-",0,null,1,0,1,"-",1,null,"X",0,2,"-",1,null,1,0,1,"-",2,null,2,3,2,"-",0,null,1,0,2,"-",1,null,1,0,1,"-",1,null,"X",0,0,"-",3,null,2,3,2,"-",1,null,1,0,3,"-",1,null,1,0,0,"-",1,null,2,5,3,"-",1,null,1,0,3,"-",1,null,1,0,4,"-",1,null,1,0,1,"-",1,null,"X",0,1,"-",1,null,"X",0,0,"-",0,null,"X",0,1,"-",1,null,"X",0,2,"-",1,null,1,0,2,"-",1,null,1,0,2,"-",0,null,1,0]
["2018-06-15","Kl 20.00","Portugal","-","Spanien",3,"-",3,null,"X",1,"-",1,null,"X",3,2,"-",1,null,1,0,2,"-",1,null,1,0,2,"-",2,null,"X",3,0,"-",3,null,2,0,2,"-",2,null,"X",3,1,"-",1,null,"X",3,2,"-",2,null,"X",3,0,"-",0,null,"X",3,3,"-",3,null,"X",5,1,"-",2,null,2,0,3,"-",1,null,1,0,1,"-",3,null,2,0,1,"-",2,null,2,0,2,"-",1,null,1,0,1,"-",1,null,"X",3,1,"-",1,null,"X",3,2,"-",2,null,"X",3,1,"-",2,null,2,0,2,"-",2,null,"X",3,1,"-",1,null,"X",3,1,"-",3,null,2,0,2,"-",1,null,1,0,1,"-",2,null,2,0,2,"-",2,null,"X",3,1,"-",2,null,2,0,2,"-",2,null,"X",3,0,"-",3,null,2,0,1,"-",1,null,"X",3,1,"-",0,null,1,0,3,"-",1,null,1,0,1,"-",1,null,"X",3,1,"-",1,null,"X",3,1,"-",3,null,2,0,3,"-",1,null,1,0,1,"-",1,null,"X",3,1,"-",1,null,"X",3,0,"-",1,null,2,0,1,"-",0,null,1,0,1,"-",1,null,"X",3,1,"-",2,null,2,0,1,"-",1,null,"X",3,0,"-",1,null,2,0,0,"-",1,null,2,0,1,"-",1,null,"X",3,1,"-",3,null,2,0,4,"-",1,null,1,0,4,"-",3,null,1,0,4,"-",3,null,1,0,1,"-",2,null,2,0,0,"-",2,null,2,0,0,"-",0,null,"X",3,1,"-",2,null,2,0,2,"-",0,null,1,0,1,"-",1,null,"X",3,2,"-",1,null,1,0]
["2018-06-16","Kl 12.00","Frankrike","-","Australien"," ","-"," ",null,0,1,"-",0,null,1,0,1,"-",0,null,1,0,2,"-",1,null,1,0,4,"-",1,null,1,0,1,"-",0,null,1,0,3,"-",1,null,1,0,3,"-",1,null,1,0,2,"-",0,null,1,0,3,"-",0,null,1,0,2,"-",1,null,1,0,2,"-",0,null,1,0,2,"-",1,null,1,0,2,"-",0,null,1,0,2,"-",0,null,1,0,4,"-",2,null,1,0,2,"-",0,null,1,0,2,"-",1,null,1,0,2,"-",1,null,1,0,3,"-",0,null,1,0,3,"-",1,null,1,0,2,"-",0,null,1,0,2,"-",1,null,1,0,4,"-",1,null,1,0,4,"-",0,null,1,0,3,"-",1,null,1,0,3,"-",0,null,1,0,4,"-",0,null,1,0,2,"-",0,null,1,0,2,"-",0,null,1,0,2,"-",0,null,1,0,3,"-",0,null,1,0,2,"-",0,null,1,0,2,"-",1,null,1,0,3,"-",0,null,1,0,2,"-",3,null,2,0,3,"-",0,null,1,0,2,"-",1,null,1,0,3,"-",0,null,1,0,1,"-",1,null,"X",0,2,"-",0,null,1,0,1,"-",0,null,1,0,2,"-",0,null,1,0,2,"-",0,null,1,0,2,"-",0,null,1,0,4,"-",0,null,1,0,2,"-",1,null,1,0,4,"-",1,null,1,0,4,"-",3,null,1,0,3,"-",2,null,1,0,3,"-",1,null,1,0,2,"-",1,null,1,0,3,"-",0,null,1,0,2,"-",0,null,1,0,3,"-",0,null,1,0,2,"-",0,null,1,0,1,"-",0,null,1,0]
["2018-06-16","Kl 15.00","Argentina","-","Island"," ","-"," ",null,0,2,"-",1,null,1,0,0,"-",1,null,2,0,2,"-",0,null,1,0,2,"-",1,null,1,0,1,"-",0,null,1,0,3,"-",0,null,1,0,3,"-",0,null,1,0,2,"-",1,null,1,0,2,"-",1,null,1,0,3,"-",2,null,1,0,2,"-",2,null,"X",0,3,"-",1,null,1,0,3,"-",1,null,1,0,1,"-",0,null,1,0,5,"-",0,null,1,0,3,"-",0,null,1,0,2,"-",0,null,1,0,0,"-",0,null,"X",0,2,"-",0,null,1,0,2,"-",1,null,1,0,2,"-",0,null,1,0,1,"-",0,null,1,0,3,"-",0,null,1,0,4,"-",1,null,1,0,2,"-",0,null,1,0,1,"-",1,null,"X",0,2,"-",1,null,1,0,1,"-",1,null,"X",0,3,"-",1,null,1,0,2,"-",0,null,1,0,3,"-",1,null,1,0,3,"-",0,null,1,0,2,"-",1,null,1,0,2,"-",2,null,"X",0,1,"-",3,null,2,0,2,"-",0,null,1,0,3,"-",0,null,1,0,1,"-",0,null,1,0,1,"-",1,null,"X",0,1,"-",0,null,1,0,2,"-",0,null,1,0,3,"-",0,null,1,0,4,"-",1,null,1,0,2,"-",1,null,1,0,1,"-",2,null,2,0,1,"-",0,null,1,0,6,"-",2,null,1,0,4,"-",3,null,1,0,2,"-",2,null,"X",0,2,"-",0,null,1,0,1,"-",1,null,"X",0,2,"-",1,null,1,0,2,"-",0,null,1,0,2,"-",0,null,1,0,3,"-",0,null,1,0,0,"-",0,null,"X",0]
["2018-06-16","Kl 18.00","Peru","-","Danmark"," ","-"," ",null,0,0,"-",0,null,"X",0,1,"-",2,null,2,0,1,"-",0,null,1,0,1,"-",3,null,2,0,0,"-",1,null,2,0,1,"-",2,null,2,0,0,"-",3,null,2,0,1,"-",2,null,2,0,2,"-",0,null,1,0,0,"-",3,null,2,0,1,"-",0,null,1,0,1,"-",3,null,2,0,1,"-",3,null,2,0,0,"-",1,null,2,0,0,"-",3,null,2,0,0,"-",0,null,"X",0,1,"-",2,null,2,0,1,"-",3,null,2,0,1,"-",1,null,"X",0,0,"-",1,null,2,0,1,"-",3,null,2,0,2,"-",1,null,1,0,1,"-",3,null,2,0,0,"-",2,null,2,0,1,"-",1,null,"X",0,1,"-",2,null,2,0,1,"-",1,null,"X",0,0,"-",1,null,2,0,0,"-",0,null,"X",0,1,"-",2,null,2,0,1,"-",1,null,"X",0,1,"-",2,null,2,0,2,"-",1,null,1,0,1,"-",2,null,2,0,1,"-",4,null,2,0,1,"-",1,null,"X",0,0,"-",2,null,2,0,1,"-",1,null,"X",0,2,"-",2,null,"X",0,2,"-",1,null,1,0,1,"-",1,null,"X",0,1,"-",1,null,"X",0,0,"-",1,null,2,0,1,"-",2,null,2,0,0,"-",1,null,2,0,2,"-",1,null,1,0,2,"-",3,null,2,0,2,"-",2,null,"X",0,4,"-",3,null,1,0,1,"-",2,null,2,0,0,"-",1,null,2,0,1,"-",1,null,"X",0,1,"-",1,null,"X",0,0,"-",2,null,2,0,1,"-",2,null,2,0,1,"-",2,null,2,0]
{"$rows_left_out":49}
{"sheet":"Blad1","index":1,"n_rows":0,"n_cols":0,"rows_kept":0,"cut":false,"hidden":false,"merged":[]}

{"sheet":"Poängställning","index":2,"n_rows":57,"n_cols":20,"rows_kept":57,"cut":false,"hidden":false,"merged":[]}
[null,null,null,null,null,null,null,null,null,null,null,null,null,"Nästa match på kupong"]
[1,"Tommy T 2",0,0,0,0,14,null,null,null,null,null,null,{"$f":"HLOOKUP($B2,Rader!$K$1:$MH$53,53,FALSE)","v":2},"-",{"$f":"HLOOKUP($B2,Rader!$M$52:$MH$53,2,FALSE)","v":1},null,{"$f":"Rader!A53","v":"2018-06-16"},null,{"$f":"Rader!B53","v":"Kl 12.00"}]
[{"$f":"A2+1","v":2},"Pernilla",0,0,0,0,14,null,null,null,null,null,null,{"$f":"HLOOKUP($B3,Rader!$K$1:$MH$53,53,FALSE)","v":3},"-",{"$f":"HLOOKUP($B3,Rader!$M$52:$MH$53,2,FALSE)","v":1},null,{"$f":"Rader!$C$53","v":"Frankrike"},"-",{"$f":"Rader!$E$53","v":"Australien"}]
[{"$f":"A3+1","v":3},"Anitha",0,0,0,0,12,null,null,null,null,null,null,{"$f":"HLOOKUP($B4,Rader!$K$1:$MH$53,53,FALSE)","v":2},"-",{"$f":"HLOOKUP($B4,Rader!$M$52:$MH$53,2,FALSE)","v":0}]
[4,"Christian",0,0,0,0,11,null,null,null,null,null,null,{"$f":"HLOOKUP($B5,Rader!$K$1:$MH$53,53,FALSE)","v":1},"-",{"$f":"HLOOKUP($B5,Rader!$M$52:$MH$53,2,FALSE)","v":0}]
[5,"Lars L",0,0,0,0,11,null,null,null,null,null,null,{"$f":"HLOOKUP($B6,Rader!$K$1:$MH$53,53,FALSE)","v":3},"-",{"$f":"HLOOKUP($B6,Rader!$M$52:$MH$53,2,FALSE)","v":1}]
[6,"Mats-ola",0,0,0,0,11,null,null,null,null,null,null,{"$f":"HLOOKUP($B7,Rader!$K$1:$MH$53,53,FALSE)","v":2},"-",{"$f":"HLOOKUP($B7,Rader!$M$52:$MH$53,2,FALSE)","v":1}]
[7,"Ludde",0,0,0,0,11,null,null,null,null,null,null,{"$f":"HLOOKUP($B8,Rader!$K$1:$MH$53,53,FALSE)","v":2},"-",{"$f":"HLOOKUP($B8,Rader!$M$52:$MH$53,2,FALSE)","v":1}]
{"$rows_left_out":50}
{"sheet":"Blad2","index":3,"n_rows":57,"n_cols":7,"rows_kept":57,"cut":false,"hidden":false,"merged":[]}
[]
[null,{"$f":"Rader!K51","v":"Christian"},{"$f":"Rader!L51","v":0},{"$f":"Rader!M51","v":0},{"$f":"Rader!N51","v":0},{"$f":"Rader!O51","v":0},{"$f":"Rader!P51","v":11}]
[null,{"$f":"Rader!Q51","v":"Manfreed"},{"$f":"Rader!R51","v":0},{"$f":"Rader!S51","v":0},{"$f":"Rader!T51","v":0},{"$f":"Rader!U51","v":0},{"$f":"Rader!V51","v":3}]
[null,{"$f":"Rader!W51","v":"Jessica"},{"$f":"Rader!X51","v":0},{"$f":"Rader!Y51","v":0},{"$f":"Rader!Z51","v":0},{"$f":"Rader!AA51","v":0},{"$f":"Rader!AB51","v":8}]
[null,{"$f":"Rader!AC51","v":"Mia E"},{"$f":"Rader!AD51","v":0},{"$f":"Rader!AE51","v":0},{"$f":"Rader!AF51","v":0},{"$f":"Rader!AG51","v":0},{"$f":"Rader!AH51","v":9}]
[null,{"$f":"Rader!AI51","v":"Till minne av Esbjörn"},{"$f":"Rader!AJ51","v":0},{"$f":"Rader!AK51","v":0},{"$f":"Rader!AL51","v":0},{"$f":"Rader!AM51","v":0},{"$f":"Rader!AN51","v":8}]
[null,{"$f":"Rader!AO51","v":"Lars L"},{"$f":"Rader!AP51","v":0},{"$f":"Rader!AQ51","v":0},{"$f":"Rader!AR51","v":0},{"$f":"Rader!AS51","v":0},{"$f":"Rader!AT51","v":11}]
[null,{"$f":"Rader!AU51","v":"Roger W"},{"$f":"Rader!AV51","v":0},{"$f":"Rader!AW51","v":0},{"$f":"Rader!AX51","v":0},{"$f":"Rader!AY51","v":0},{"$f":"Rader!AZ51","v":6}]
{"$rows_left_out":50}
{"sheet":"Blad3","index":4,"n_rows":50,"n_cols":18,"rows_kept":50,"cut":false,"hidden":false,"merged":[[0,8,0,10],[0,12,0,14],[0,16,0,18],[0,3,0,5],[49,3,49,5]]}
[null,"Datum","Tid","Namn:"]
[null,"2018-06-14","Kl 17.00","Ryssland","-","Saudiarabien",null,null,null,"-",null,null,null,"-",null,null,null,"-"]
[null,"2018-06-15","Kl 14.00","Egypten",{"$f":"E2","v":"-"},"Uruguay",null,null,null,"-",null,null,null,"-",null,null,null,"-"]
[null,"2018-06-15","Kl 17.00","Marocko","-","Iran",null,null,null,"-",null,null,null,"-",null,null,null,"-"]
[null,"2018-06-15","Kl 20.00","Portugal","-","Spanien",null,null,null,"-",null,null,null,"-",null,null,null,"-"]
[null,"2018-06-16","Kl 12.00","Frankrike","-","Australien",null,null,null,"-",null,null,null,"-",null,null,null,"-"]
[null,"2018-06-16","Kl 15.00","Argentina","-","Island",null,null,null,"-",null,null,null,"-",null,null,null,"-"]
[null,"2018-06-16","Kl 18.00","Peru","-","Danmark",null,null,null,"-",null,null,null,"-",null,null,null,"-"]
{"$rows_left_out":43}
{"sheet":"Blad5","index":5,"n_rows":60,"n_cols":8,"rows_kept":60,"cut":false,"hidden":false,"merged":[[1,5,1,7],[3,2,3,4]]}
[]
[null,null,null,null,null,"Nästa match på kupongen"]
[null,null,"Uppdaterat",null,null,{"$f":"Poängställning!R2","v":"2018-06-16"},null,{"$f":"Poängställning!T2","v":"Kl 12.00"}]
[null,null,{"$f":"NOW()","v":"2018-06-15T21:53:53.350"},null,null,{"$f":"Poängställning!R3","v":"Frankrike"},{"$f":"Poängställning!S3","v":"-"},{"$f":"Poängställning!T3","v":"Australien"}]
[null,null,{"$f":"Poängställning!B2","v":"Tommy T 2"}," ",{"$f":"Poängställning!G2","v":14},{"$f":"Poängställning!N2","v":2},{"$f":"Poängställning!O2","v":"-"},{"$f":"Poängställning!P2","v":1}]
[null,null,{"$f":"Poängställning!B3","v":"Pernilla"}," ",{"$f":"Poängställning!G3","v":14},{"$f":"Poängställning!N3","v":3},{"$f":"Poängställning!O3","v":"-"},{"$f":"Poängställning!P3","v":1}]
[null,null,{"$f":"Poängställning!B4","v":"Anitha"}," ",{"$f":"Poängställning!G4","v":12},{"$f":"Poängställning!N4","v":2},{"$f":"Poängställning!O4","v":"-"},{"$f":"Poängställning!P4","v":0}]
[null,null,{"$f":"Poängställning!B5","v":"Christian"}," ",{"$f":"Poängställning!G5","v":11},{"$f":"Poängställning!N5","v":1},{"$f":"Poängställning!O5","v":"-"},{"$f":"Poängställning!P5","v":0}]
{"$rows_left_out":53}
{"sheet":"Blad4","index":6,"n_rows":0,"n_cols":0,"rows_kept":0,"cut":false,"hidden":false,"merged":[]}